﻿keyword,campaign_name,"2011-07-03","2011-07-10","2011-07-20","2011-07-23","2011-07-30","2011-08-06","2011-08-13","2011-08-28","2011-11-17","2011-11-19","2011-11-24","2011-11-26","2011-12-01","2011-12-03","2011-12-08","2011-12-10","2011-12-15","2011-12-17","2011-12-22","2011-12-24","2011-12-29","2012-01-15","2012-01-22","2012-01-29","2012-02-05","2012-02-13","2012-02-19","2012-02-26","2012-03-04","2012-03-18","2012-03-25","2012-04-21","2012-04-27","2012-05-04","2012-05-11","2012-05-18","2012-05-25","2012-06-01","2012-06-08","2012-06-15","2012-06-22","2012-06-29","2012-11-07","2012-11-10","2012-11-17","2012-11-24","2012-12-01","2012-12-08","2012-12-15","2012-12-22","2012-12-29","2013-01-12","2013-01-19","2013-01-26","2013-02-02","2013-02-09","2013-02-16","2013-02-23","2013-03-02","2013-03-09","2013-03-16","2013-03-23","2013-03-30","2013-04-06","2013-04-13","2013-04-20","2013-04-27","2013-05-04","2013-05-11","2013-05-18","2013-05-25","2013-06-01","2013-06-08","2013-06-23","2013-06-30","2013-07-07","2013-07-13","2013-07-27","2013-08-03","2013-08-10","2013-08-17","2013-08-24","2013-08-31","2013-09-07","2013-09-14","2013-09-21","2013-09-28","2013-10-05","2013-10-12","2013-10-19","2013-10-26","2013-11-02","2013-11-09","2013-11-23","2013-11-30","2013-12-07","2013-12-14","2013-12-21","2014-01-18","2014-01-25","2014-02-01","2014-02-08","2014-02-15","2014-02-22","2014-03-01","2014-03-08","2014-03-15","2014-03-29","2014-04-05","2014-04-12","2014-04-19","2014-04-26","2014-05-03","2014-05-10","2014-05-17","2014-05-24","2014-05-31","2014-06-07","2014-06-14","2014-06-21","2014-06-28","2014-07-05","2014-07-12","2014-07-19","2014-07-26","2014-08-02","2014-08-09","2014-08-16","2014-08-23","2014-08-30","2014-09-06","2014-09-13","2014-09-20","2014-09-27","2014-10-04","2014-10-11","2014-10-18","2014-10-25","2014-11-01","2014-11-08","2014-11-15","2014-11-22","2014-11-29","2014-12-06","2014-12-13","2014-12-20","2014-12-27","2015-01-24","2015-01-31","2015-02-07","2015-02-14","2015-02-21","2015-02-28","2015-03-07","2015-03-14","2015-03-21","2015-03-28","2015-04-04","2015-04-13","2015-05-11","2015-06-02","2015-06-15","2015-06-20","2015-06-27","2015-07-04","2015-07-11","2015-07-25","2015-08-02","2015-08-08","2015-08-15","2015-08-22","2015-08-29","2015-09-05","2015-09-12","2015-09-19","2015-10-10","2015-10-31","2015-11-07","2015-11-14","2015-11-21","2015-11-28","2015-12-05","2015-12-12","2015-12-19","2015-12-26","2016-01-02","2016-01-09","2016-01-16","2016-01-23","2016-01-30","2016-02-06","2016-02-13","2016-02-20","2016-02-29","2016-03-13","2016-03-21","2016-05-08","2016-05-15","2016-05-18","2016-05-20","2016-05-22","2016-05-29","2016-06-05","2016-06-12","2016-06-18","2016-06-26","2016-07-04","2016-07-10","2016-07-24","2016-07-30","2016-08-06","2016-08-14","2016-08-20","2016-08-27","2016-09-03","2016-09-10","2016-09-24","2016-10-08","2016-10-15","2016-10-22","2016-10-29","2016-11-05","2016-11-12","2016-11-19","2016-11-26","2016-12-03","2016-12-10","2016-12-24","2016-12-31","2017-01-07","2017-01-14","2017-01-21","2017-01-28","2017-02-04","2017-02-11","2017-02-18","2017-02-25","2017-03-04","2017-03-11","2017-03-18","2017-03-25","2017-04-01","2017-04-08","2017-04-22","2017-05-06","2017-05-13","2017-05-20","2017-05-27","2017-06-03","2017-06-10","2017-06-17","2017-06-24","2017-07-01","2017-07-08","2017-07-15","2017-07-22","2017-07-29","2017-08-05","2017-08-12","2017-08-20","2017-08-26","2017-09-02","2017-09-10","2017-09-17","2017-09-24","2017-10-01","2017-10-03","2017-10-08","2017-10-14","2017-10-22","2017-10-29","2017-11-05","2017-11-13","2017-11-19","2017-11-26","2017-12-03","2017-12-10","2017-12-18","2017-12-28","2017-12-31","2018-01-08","2018-01-14","2018-01-22","2018-01-28","2018-02-04"
Forex Teknik,"Google Turkey (Turkey); Organic",,,,,,,,,,,,,,,,,,,,,,,,,,,,,7,6,,,15,16,16,18,19,19,33,29,26,51,8,9,9,7,7,9,4,4,4,4,4,4,5,5,8,7,6,6,4,5,5,4,4,4,2,4,4,4,4,4,3,4,4,4,3,2,4,6,5,2,3,3,3,8,8,6,6,9,9,7,6,8,6,6,6,6,8,6,6,6,4,6,4,4,4,4,8,8,8,10,10,9,9,9,9,9,8,8,4,4,4,4,4,4,4,4,4,3,4,4,5,5,4,5,5,5,5,7,7,7,7,9,7,7,7,9,10,8,9,8,8,8,10,11,8,8,8,11,,10,,10,10,10,10,,9,9,8,9,,,,,,,,,9,9,8,,,,8,,,,6,,,9,,,,,,9,,,,,,,9,12,,13,,,9,18,19,19,11,12,9,14,12,12,12,7,10,10,10,9,9,10,,10,7,7,8,9,10,11,9,,10,12,8,10,11,15,9,8,18,8,9,11,9,13,10,10,8,8,7,5,12,7,12,8,8,,5,7,9,8,6,,20,,,,,,,,,,,,
Forex Teknik Analizi,"Google Turkey (Turkey); Organic",,,,,,,,,,,,,,,,,,,,,,,,,,,,,6,5,,,11,10,10,49,12,14,24,23,19,18,6,5,6,5,5,6,6,6,7,6,6,6,6,7,8,5,5,6,6,6,4,4,5,3,4,4,4,3,5,4,5,6,6,7,4,6,6,6,6,7,4,6,7,7,8,6,7,7,8,6,6,9,8,8,9,9,8,8,8,8,8,6,6,8,6,6,6,4,4,4,4,4,6,4,6,4,6,6,7,6,6,7,6,6,4,4,4,4,4,4,4,4,4,6,6,6,6,7,5,5,5,7,5,5,5,7,7,5,5,6,5,4,5,5,6,7,8,8,,11,,11,,,,,5,5,,,,3,,,,,,,,6,,8,8,8,8,7,,,,,,5,,6,,,,6,,,,,,,9,9,,,,,8,8,9,18,9,19,10,10,11,10,11,9,8,8,8,19,18,8,,9,9,9,7,7,12,12,12,11,14,13,13,9,14,17,9,8,9,13,8,9,14,12,13,13,7,7,7,7,7,8,8,8,6,,8,6,6,7,8,7,6,6,,,,,6,,,,,,
Forex İslami Hesaplar,"Google Turkey (Turkey); Organic",,,,,,,,,,,,,,,,,,,,,,,,,,,,,5,5,,,38,36,36,35,34,36,40,46,43,43,2,2,3,2,2,2,2,2,2,1,2,1,1,1,1,2,2,3,1,1,1,1,1,1,1,1,1,1,1,1,1,1,1,1,1,1,1,1,1,1,1,1,1,1,1,1,1,1,1,1,1,1,1,1,1,1,1,1,1,1,1,1,1,1,1,2,1,1,1,1,1,1,1,1,1,1,1,1,1,1,1,1,1,1,1,1,1,1,1,1,1,1,1,1,1,1,1,1,1,1,1,1,1,1,1,1,1,1,1,1,1,1,1,1,1,1,1,1,,1,,1,,,,,,1,1,1,,,1,,1,,,,,1,,,,,1,,1,1,1,,,1,,1,,,,1,,,,,,,1,1,,1,1,,1,1,1,1,1,1,1,1,1,1,1,1,1,1,1,1,1,1,,1,1,1,1,1,1,1,1,1,1,,1,1,1,1,1,1,1,1,1,1,1,1,1,1,1,1,1,1,1,1,1,1,1,,1,1,1,1,1,1,1,1,,,,,,,,,,,
Helal Forex,"Google Turkey (Turkey); Organic",,,,,,,,,,,,,,,,,,,,,,,,,,,,,5,6,,,10,6,6,6,4,9,13,9,6,7,1,1,2,2,2,1,1,1,1,3,3,3,3,3,3,2,1,2,1,1,2,1,1,1,1,1,1,1,1,1,1,1,1,1,1,1,1,1,1,1,1,2,1,1,1,1,1,1,1,1,1,1,1,1,1,1,1,1,1,1,1,1,1,1,1,1,1,1,1,1,1,1,1,1,1,2,1,1,2,2,2,2,1,1,1,1,1,1,1,1,1,1,1,1,1,1,1,1,1,1,1,1,1,3,1,1,1,1,1,1,1,1,1,1,1,1,1,1,,1,,1,,,,,,,,2,,,,,2,,,,,2,,,,,,14,,,,2,,2,,2,,,,2,2,,,,,,2,2,2,,,,2,2,2,3,2,2,2,2,2,3,2,1,2,2,2,3,2,3,,2,2,2,1,1,1,1,2,2,2,2,2,2,2,2,1,1,1,1,1,1,1,1,1,1,1,1,1,1,1,1,1,1,1,,1,1,1,1,1,1,1,1,,,,,,,,,1,,
İslami Forex,"Google Turkey (Turkey); Organic",,,,,,,,,,,,,,,,,,,,,,,,,,,,,3,3,,,32,38,34,39,38,40,50,51,43,49,2,2,2,2,2,2,2,2,2,2,2,2,2,2,2,2,2,2,2,2,2,2,2,2,2,2,2,2,2,3,4,3,3,3,2,2,2,2,2,1,1,3,1,2,2,1,2,2,1,1,1,1,1,1,1,1,1,1,1,1,1,1,1,1,1,1,1,1,1,1,1,1,1,1,1,1,1,1,1,1,1,1,1,1,1,1,1,1,1,1,1,1,1,1,1,1,1,1,1,1,1,1,1,2,2,1,1,1,1,1,1,1,1,1,1,1,1,1,,1,,1,,,,,1,,,,,,,,,,,1,,1,,,,,,,,1,,,,1,,1,,,,1,,,,,,,1,1,,,,,1,1,1,1,1,1,1,1,1,1,1,1,1,1,1,1,1,1,,1,1,1,1,1,1,1,1,1,1,1,1,1,1,1,1,1,1,1,1,1,1,1,1,1,1,1,1,1,1,1,1,1,1,,1,1,1,1,1,1,1,1,,,,,,,,,2,,1
Forex Dolandırıcılık,"Google Turkey (Turkey); Organic",,,,,,,,,,,,,,,,,,,,,,,,,,,,,4,4,,,19,22,19,19,20,19,32,14,28,8,3,2,3,2,3,3,3,3,2,2,2,2,2,3,3,5,5,3,5,5,5,5,5,5,5,3,3,3,2,2,2,3,4,3,2,2,4,3,3,3,2,2,3,3,3,3,3,3,3,3,3,3,5,4,6,6,7,7,7,7,7,7,6,7,6,4,8,9,9,6,7,6,7,5,6,5,4,4,9,8,7,8,7,7,7,6,2,3,3,4,3,2,2,2,2,4,2,2,2,2,2,2,2,2,2,6,7,7,5,5,2,3,3,4,5,4,2,9,,4,,7,8,,7,,,,6,,,,,,,,,13,,14,,7,,,7,,,,9,,,9,,,,,,6,,,,,,,6,,,6,,,6,7,6,6,6,6,6,6,5,6,6,14,7,14,15,8,15,8,,8,15,14,8,9,9,8,13,16,16,16,16,15,15,15,14,13,14,13,14,14,12,12,13,14,12,9,16,9,8,5,5,5,5,,5,5,6,6,7,7,7,7,,,,,,,,,,,
forex sahtekarlığı,"Google Turkey (Turkey); Organic",,,,,,,,,,,,,,,,,,,,,,,,,,,,,2,2,,,3,3,3,3,3,3,3,3,3,3,2,2,2,2,2,2,2,2,2,2,2,2,2,2,2,2,2,2,2,2,2,2,2,2,2,2,1,1,2,1,1,1,1,1,1,1,1,1,1,1,1,1,1,1,1,1,1,1,1,1,1,1,1,1,1,1,1,1,1,1,1,1,1,1,1,2,2,2,2,2,2,1,1,1,1,1,1,1,2,2,2,2,1,1,1,2,1,2,2,2,2,2,2,2,2,2,2,2,2,2,2,2,2,2,2,2,2,1,1,1,1,1,1,2,3,2,2,2,,3,,2,,,2,,,,2,2,,2,,,,,,,,2,2,2,,,2,,,,2,,,3,,2,,,,3,,,,,,,2,,,2,2,,2,2,2,2,2,2,2,2,2,2,2,3,3,3,3,3,3,3,,4,4,4,4,4,4,4,4,4,4,4,4,4,3,3,3,4,4,4,4,3,3,3,3,3,4,4,5,3,3,2,3,2,2,,2,2,2,2,2,,,2,,,,,,,,,,,
Forex Öğrenin,"Google Turkey (Turkey); Organic",,,,,,,,,,,,,,,,,,,,,,,,,,,,,9,8,,,10,9,39,9,8,8,9,38,32,35,5,4,4,5,5,5,5,5,5,5,5,5,5,5,5,5,5,5,4,4,4,3,3,2,4,3,2,4,2,1,2,2,1,2,2,1,2,4,4,4,4,3,4,4,3,4,4,4,4,4,3,2,4,8,7,4,2,2,2,2,2,2,2,2,2,3,3,3,3,4,6,6,6,4,4,3,3,3,2,3,4,3,2,3,3,2,3,2,4,3,4,4,3,3,3,4,4,3,3,3,3,3,4,4,4,4,3,3,3,4,3,3,3,4,4,5,5,5,,5,,6,,,,,,,5,,,,,5,,,4,3,3,3,5,3,,,4,,,,,,,6,,10,,4,,3,,,,,,,3,,3,,,,4,3,5,6,6,5,5,6,4,5,5,4,4,4,5,5,4,5,,4,3,4,2,2,,2,,2,2,2,2,4,3,2,1,1,1,1,1,2,3,4,4,5,4,3,1,1,1,1,1,1,1,,1,1,1,1,1,,5,4,,,,,,,,,,,
Forex Eğitimi,"Google Turkey (Turkey); Organic",,,,,,,,,,,,,,,,,,,,,,,,,,,,,30,16,,,36,24,24,27,40,49,44,39,39,37,13,15,16,14,13,16,19,26,22,25,23,20,19,23,24,23,23,23,25,21,21,24,26,25,22,25,24,23,18,19,19,21,20,22,21,20,21,19,20,22,16,22,21,25,22,23,23,20,23,23,23,22,24,24,19,,25,24,25,26,27,23,23,17,14,18,22,20,21,18,18,22,20,20,18,16,15,17,17,19,18,18,19,18,16,17,18,16,18,17,19,17,17,16,17,14,13,13,14,13,16,19,19,18,17,22,23,22,21,25,24,22,23,22,21,27,29,30,,27,,31,,,,,,,40,43,,36,37,,,,,28,32,,,24,,25,,24,,,24,,,23,,23,,,,19,,,,,,,20,,,21,,,10,12,11,10,14,20,17,14,15,12,11,12,16,15,14,19,20,16,,13,14,12,12,13,13,16,,18,20,23,19,18,17,16,12,12,12,12,13,15,18,19,19,16,14,16,21,12,11,11,12,11,12,,10,10,11,10,9,,17,20,,,,,,,,,,,11
ücretsiz forex sinyalleri,"Google Turkey (Turkey); Organic",,,,,,,,,,,,,,,,,,,,,,,,,,,,,8,4,,,45,9,9,9,53,54,42,48,45,45,7,7,7,6,6,5,3,6,6,3,3,3,3,3,3,9,7,3,3,4,1,1,1,2,1,1,2,2,3,2,5,4,6,3,2,1,1,1,1,1,2,2,1,1,4,2,2,3,2,3,3,2,2,2,2,1,2,1,2,2,3,3,2,2,3,4,4,4,4,3,3,3,3,2,2,1,4,2,3,5,5,3,5,5,3,2,4,4,4,4,4,3,3,4,4,4,3,3,3,3,3,3,3,3,4,4,4,3,3,3,3,1,2,3,1,1,1,1,,1,,1,,,,,,,1,1,,,,,,,1,,,,,,,,,,,1,,,,1,,1,,,,2,,,,,,,3,,,,,2,2,2,2,2,2,2,2,2,2,1,2,2,1,3,1,2,2,2,,2,1,1,1,1,1,1,1,1,1,1,1,2,1,1,2,1,1,1,1,2,1,1,1,1,1,1,1,2,2,2,2,2,2,2,2,2,2,2,2,,,2,,,,,,,,,,,
forex sinyal programı,"Google Turkey (Turkey); Organic",,,,,,,,,,,,,,,,,,,,,,,,,,,,,1,1,,,2,2,2,2,1,1,1,1,1,1,1,1,1,1,1,1,1,1,1,1,1,1,1,1,1,1,1,1,1,1,1,1,1,1,2,2,3,3,1,1,1,4,4,2,1,1,1,1,1,1,1,1,1,1,1,1,1,1,1,1,1,1,1,1,1,1,1,1,1,1,1,1,1,1,1,1,1,1,1,1,1,1,1,1,1,1,1,1,1,1,1,1,1,1,1,1,1,1,1,1,1,1,1,1,2,2,2,2,2,1,2,2,1,2,2,2,2,2,2,2,2,2,2,2,2,2,2,1,,2,,2,,,,1,,,1,,1,,1,1,,,,,1,1,,,,,,,,1,1,,,1,,1,,,,2,,,,,,,1,,,1,1,,1,1,1,1,1,1,1,1,1,1,1,1,1,1,1,1,1,1,,1,1,1,1,1,1,1,,1,1,1,1,1,1,1,1,1,1,1,1,1,1,1,1,1,1,1,1,1,1,1,1,1,1,,1,1,1,1,1,,,1,,,,,,,,,,,
forex sinyal,"Google Turkey (Turkey); Organic",,,,,,,,,,,,,,,,,,,,,,,,,,,,,2,2,,,7,49,49,48,5,6,7,7,7,6,2,2,3,2,1,1,3,4,3,3,1,1,2,2,5,8,10,11,13,13,13,7,7,8,4,4,6,5,2,5,6,8,5,4,1,1,2,1,1,1,1,1,1,1,1,1,1,1,1,1,1,1,1,1,1,1,1,1,1,1,1,1,1,1,1,1,1,1,1,1,1,1,1,1,1,1,1,1,1,1,1,1,1,1,1,1,1,1,1,1,1,1,1,1,1,1,1,1,1,1,1,1,1,1,1,1,1,1,1,1,1,1,1,1,2,3,3,1,,2,,2,,2,,,,,,,,,,,,,,,1,1,,1,,1,,4,1,,,,,2,,2,,,,3,,,,,,,2,,2,,,,2,2,2,2,2,2,2,2,2,2,2,2,2,3,2,2,2,2,,2,2,2,2,2,2,2,,2,2,2,2,2,2,2,2,2,2,2,2,2,2,2,2,2,2,2,2,2,2,2,2,2,2,,2,2,2,2,2,,,2,,,,,,,,,,,
forex dersleri,"Google Turkey (Turkey); Organic",,,,,,,,,,,,,,,,,,,,,,,,,,,,,9,9,,,12,12,12,18,18,24,25,18,16,4,6,6,7,6,6,6,5,5,6,5,5,5,5,5,5,5,5,4,4,5,4,4,5,6,4,4,4,4,3,3,3,6,7,7,7,7,7,6,4,4,4,5,5,6,5,5,5,4,4,4,4,5,4,4,5,6,7,7,7,6,6,6,7,6,6,6,10,10,9,9,10,10,10,10,10,10,9,10,8,8,9,8,8,8,8,8,8,9,8,8,9,8,9,9,10,10,10,10,10,11,11,11,11,11,12,11,11,11,10,11,11,11,11,11,10,10,9,8,,10,,14,,12,,,,,17,18,18,,,,15,,15,,13,11,10,,,,,,,,,,,12,,,,13,,15,17,,,,,,6,,6,12,,,12,11,13,16,19,13,11,14,13,11,14,12,17,19,22,14,14,13,,10,12,10,9,11,,9,7,9,14,7,6,6,10,10,7,8,8,6,6,7,5,7,7,7,8,8,10,4,5,7,7,7,7,,7,6,7,6,6,7,52,,,7,,,6,,,,,,6
forex kursları,"Google Turkey (Turkey); Organic",,,,,,,,,,,,,,,,,,,,,,,,,,,,,5,5,,,31,35,33,35,38,38,48,37,38,41,4,4,4,4,4,4,5,5,5,5,5,5,5,6,6,6,9,9,9,9,8,7,7,8,6,8,8,8,7,7,7,7,7,7,6,6,6,6,7,7,7,7,7,8,8,7,8,8,9,9,9,10,9,11,9,10,10,10,10,10,9,13,10,8,8,10,13,13,12,12,15,13,13,13,12,10,14,13,13,13,12,13,13,12,13,13,10,10,10,10,10,10,10,10,10,10,10,10,12,10,12,12,12,12,9,10,9,9,10,12,9,8,7,8,9,8,8,7,,9,,10,,,,11,,,,,,,,,,13,,,10,10,,10,,,9,,,,,,,9,,7,,,,9,17,,,,9,,8,,,,,,9,12,12,11,9,14,17,16,9,17,16,9,18,18,17,15,9,9,,9,4,4,4,4,4,3,,8,8,,7,7,8,6,4,3,5,5,3,4,3,7,7,7,7,7,4,2,3,2,2,2,2,3,3,3,3,2,1,3,,,,,,,3,,,,,,
Otomatik Forex,"Google Turkey (Turkey); Organic",,,,,,,,,,,,,,,,,,,,,,,,,,,,,5,5,,,45,47,50,9,49,49,49,45,38,45,4,4,4,4,4,4,3,3,3,3,3,3,3,3,3,3,3,3,3,3,4,4,4,2,2,3,3,3,3,4,4,6,6,6,3,3,3,3,2,2,2,2,2,3,3,2,3,2,3,3,3,3,4,3,3,3,3,3,3,2,2,2,2,2,2,2,2,2,2,2,2,2,2,2,2,2,2,3,2,2,2,2,2,2,2,2,2,2,2,2,1,1,1,2,2,3,3,3,3,3,4,4,4,5,5,4,5,5,5,5,5,5,5,5,3,4,4,4,,4,,4,,4,,,,,3,3,,,,,6,,,,3,,,,,,,,7,7,,,,7,,7,,,,9,,,,,,,6,,,,6,5,5,8,7,7,6,4,6,4,5,7,6,6,6,6,6,6,4,4,,4,5,5,3,3,2,3,,2,2,3,2,2,3,2,3,4,3,4,3,5,5,4,4,4,5,4,4,4,3,4,4,3,3,4,4,4,4,4,4,4,,,,,,,,,,,,3,
Forex Siteleri,"Google Turkey (Turkey); Organic",,,,,,,,,,,,,,,,,,,,,,,,,,,,,7,8,,,9,9,8,8,8,9,16,12,12,34,4,4,4,4,5,5,5,5,5,5,5,6,6,6,4,3,3,3,2,2,2,2,2,2,2,3,3,3,3,3,2,2,2,2,2,2,2,2,2,2,2,2,2,2,2,2,2,2,2,2,2,2,1,1,2,2,1,3,3,3,3,3,3,3,3,3,3,3,4,4,4,4,4,4,4,4,3,3,3,2,2,2,3,2,2,3,3,3,3,3,3,3,3,3,1,1,1,2,1,1,1,2,2,2,2,1,1,2,2,3,3,2,2,2,2,3,3,3,,2,,,,1,,1,,,,,,2,,,,,,,2,3,,3,,,,3,3,,,,,3,,3,,,,4,,,,,,,4,,3,,6,,4,7,7,4,4,8,5,6,14,13,9,9,7,3,9,13,12,12,,8,8,8,10,8,3,4,4,4,8,4,8,4,8,6,6,9,17,13,8,7,6,8,8,9,13,13,12,2,8,7,5,6,6,7,7,4,6,5,2,4,,,,,,,,,,,,,
forex firmaları,"Google Turkey (Turkey); Organic",,,,,,,,,,,,,,,,,,,,,,,,,,,,,10,8,,,14,14,15,16,15,16,19,25,19,16,4,4,7,6,9,10,7,8,7,6,6,5,5,4,4,6,2,2,2,2,2,2,2,2,2,2,2,3,3,3,4,3,4,4,4,2,4,3,4,3,3,3,3,3,3,3,3,4,3,3,4,3,4,4,4,4,3,3,3,3,3,3,3,2,3,3,3,3,2,2,2,2,2,2,2,2,2,2,2,2,2,2,2,2,2,2,2,2,2,2,2,2,2,2,2,2,2,2,2,2,2,2,2,2,2,3,2,2,3,3,2,2,2,2,2,2,2,3,,2,,,2,,2,,,,,3,,2,,,,,2,,,1,,,,,1,5,,1,1,,,1,,1,,,,4,4,,,,,3,3,,,,,1,2,2,1,4,4,4,5,5,5,5,5,5,2,2,5,4,5,4,,1,1,1,1,2,,1,3,3,3,3,3,2,2,3,4,3,4,3,4,8,8,8,7,8,7,10,11,4,5,6,6,6,4,6,5,7,4,4,4,6,5,,,4,,,,,,,,,
forex şirketleri,"Google Turkey (Turkey); Organic",,,,,,,,,,,,,,,,,,,,,,,,,,,,,6,4,,,5,4,4,5,4,6,10,9,4,12,5,7,6,6,5,5,5,6,5,5,5,5,7,5,6,7,5,6,7,7,5,7,7,8,7,7,8,8,7,7,9,4,4,4,4,4,4,4,4,4,4,6,4,4,6,3,3,3,3,3,3,4,3,3,4,4,3,3,3,4,4,3,4,3,4,3,5,3,3,3,4,4,3,3,3,3,4,4,3,3,3,3,3,2,2,2,2,2,2,2,2,2,2,2,2,2,2,2,2,3,4,3,4,3,3,6,6,7,7,6,7,7,7,4,6,6,6,6,,7,,,,,,,,,,9,,,,,9,9,,,,,,,,,6,6,7,,7,,,6,,4,,9,,8,8,,,,,,6,,6,,,,7,7,9,8,5,6,7,7,9,8,8,9,7,7,6,8,7,7,,6,6,3,3,3,3,2,,3,3,,3,3,3,3,3,3,2,2,2,4,6,5,6,5,4,5,6,2,2,3,1,2,1,1,1,1,1,1,2,,,,,1,,,,,,,,,1
Forex Brokerları,"Google Turkey (Turkey); Organic",,,,,,,,,,,,,,,,,,,,,,,,,,,,,2,2,,,31,33,33,32,34,30,43,40,28,30,1,1,1,1,1,1,1,1,1,1,1,1,1,1,1,3,3,3,3,2,2,2,2,2,2,2,2,2,2,2,2,2,2,2,2,2,2,2,2,2,2,2,2,2,2,2,2,2,2,2,2,2,2,2,2,2,2,2,2,2,2,2,2,2,2,2,2,2,2,2,2,2,2,2,2,2,2,2,2,2,2,2,2,2,2,2,2,2,2,2,2,2,2,2,2,2,2,2,2,2,2,2,2,2,2,2,2,2,1,1,1,1,1,1,3,3,3,2,,1,,1,2,,,,,,,,,2,,2,,,,,1,2,,,,2,,,,,2,,,2,,2,,,,2,2,,,,,,3,,,,,3,3,3,3,3,3,3,3,5,4,7,4,6,5,5,4,6,6,6,,,6,5,7,7,5,5,,5,5,6,8,3,4,4,4,3,3,3,3,3,3,3,3,3,3,4,3,4,3,3,3,3,3,3,3,3,3,3,3,,,,,,,,,,,,,2,
Forex Ticareti,"Google Turkey (Turkey); Organic",,,,,,,,,,,,,,,,,,,,,,,,,,,,,3,4,,,37,34,35,32,33,15,31,32,52,42,3,3,3,4,3,5,6,4,4,10,13,13,18,14,11,15,16,15,17,14,10,14,15,14,13,12,10,10,9,10,9,9,8,9,10,9,12,10,10,10,3,12,2,7,12,6,6,5,3,3,3,3,4,3,3,3,3,4,3,4,4,4,2,2,2,3,6,5,4,6,6,7,6,5,5,5,6,7,7,7,8,7,8,7,7,6,6,8,7,7,7,9,9,9,8,13,9,,6,9,8,8,9,8,9,15,13,12,17,17,16,15,16,14,16,17,18,22,,22,,,,24,,,,,,,,22,,,,,,,,,,,,,,,17,,,,,16,,13,,13,,15,,,,,12,,14,,,,15,,16,9,7,7,18,19,21,13,8,11,9,12,9,8,12,9,13,12,,,14,15,14,7,,7,7,7,7,,13,8,8,8,9,8,9,8,8,9,8,8,9,8,16,12,12,13,13,6,6,5,8,12,11,8,13,13,12,,,,8,,,,,,,,,,
forex işlemleri,"Google Turkey (Turkey); Organic",,,,,,,,,,,,,,,,,,,,,,,,,,,,,8,7,,,76,9,8,10,57,10,19,18,40,25,8,8,9,10,11,12,11,11,10,10,9,10,11,11,11,9,11,11,9,9,10,10,9,12,15,15,15,16,12,15,9,17,18,20,21,21,21,23,20,21,18,22,21,22,22,20,21,18,19,19,21,20,20,16,19,17,21,20,20,17,19,19,17,19,18,20,18,18,22,23,25,27,25,23,23,23,25,24,22,23,23,22,21,22,21,23,30,19,18,19,20,22,18,21,21,25,21,28,26,28,28,28,28,28,31,36,,32,30,28,28,29,28,32,31,34,36,50,,52,,55,,,,,,,,58,,,,,53,,,,,42,,42,41,,,,,,29,,,30,,31,,40,,39,,,,,42,38,35,,32,,,27,28,29,29,33,34,36,39,35,36,42,42,38,42,38,35,32,33,38,,29,29,27,27,29,32,28,,28,28,27,30,29,25,27,28,25,26,28,28,28,24,23,23,22,22,23,25,22,17,15,14,31,36,,21,17,22,41,25,,,,34,,,,45,,,,,9,13
Forex Nedir?,"Google Turkey (Turkey); Organic",,,,,,,,,,,,,,,,,,,,,,,,,,,,,,,,,,,,,,,,,93,99,,,,,,,,,,,,,,,,,,,,,,,,,,,,,60,64,61,59,61,71,72,57,57,58,57,51,39,47,49,50,49,44,52,48,49,52,50,59,42,44,41,42,52,52,50,36,39,35,36,34,38,31,35,34,26,28,26,25,30,30,27,29,29,28,32,33,31,32,29,27,29,34,36,31,28,28,26,27,27,32,28,26,30,32,30,31,37,40,37,34,38,28,40,33,34,40,46,43,45,44,44,41,43,54,,51,,53,,,,,,,46,,46,50,,,52,,,,47,44,,,,,,47,35,50,50,,,36,,40,,,,50,,,,,,,46,,,21,18,,27,30,44,46,44,44,47,29,24,45,45,47,55,56,51,52,54,53,,33,44,47,44,42,39,38,,45,44,,43,44,40,41,39,30,39,31,38,30,46,43,42,41,43,44,44,40,39,34,36,37,27,,26,24,34,28,27,,26,,,,,,,,,,29,,
Brokerlar,"Google Turkey (Turkey); Organic",,,,,,,,,,,,,,,,,,,,,,,,,,,,,,,,,,,,,,,,,,,4,4,4,4,8,13,20,12,14,11,24,21,27,23,21,21,12,15,14,14,13,10,10,10,10,9,12,14,13,13,12,12,14,17,13,13,13,14,16,17,13,14,13,17,13,17,18,23,20,20,20,19,19,18,20,22,22,22,21,21,20,22,27,27,21,22,23,23,24,28,21,18,19,29,,27,20,34,29,26,19,25,26,29,25,28,28,28,27,29,28,29,22,25,26,29,31,29,40,38,41,39,44,35,37,40,36,34,42,31,29,23,26,21,20,23,26,22,,27,,27,,22,25,,,,,,50,,49,,,,,,35,,,,37,,,,31,28,,29,,26,,13,,,,25,,,25,,,,15,,,24,20,,21,27,26,29,27,26,18,13,19,22,28,11,10,12,13,22,24,22,,30,13,15,14,13,15,16,20,30,25,27,30,26,25,25,26,19,26,25,24,30,40,43,40,40,42,39,41,40,39,36,35,32,38,,36,37,40,30,29,34,,25,,,,,,,,,,,
daily forex,"Google Turkey (Turkey); Organic",,,,,,,,,,,,,,,,,,,,,,,,,,,,,,,,,,,,,,,,,,,4,4,10,10,10,4,10,10,10,4,4,10,4,10,10,1,1,1,1,1,1,1,1,1,1,1,1,1,1,1,1,1,1,1,1,1,1,1,1,1,1,1,1,1,1,1,1,1,1,1,1,1,1,1,1,1,1,1,1,1,1,1,1,1,1,1,1,1,1,1,1,1,1,1,1,1,1,1,1,1,1,1,1,1,1,1,1,1,1,1,1,1,1,1,1,1,1,1,1,1,1,1,1,1,1,1,1,1,1,1,1,1,1,1,1,1,1,1,,1,,1,1,,,,,,,,,,1,,,,,,,1,,,,,1,,,,,,,1,,1,,,,1,,,,,,,1,,1,,1,,1,1,1,1,1,1,1,1,1,1,1,1,1,1,1,1,1,1,,1,1,1,1,1,1,,1,,1,,1,1,1,1,1,1,1,1,1,1,1,1,1,1,1,1,1,1,1,1,1,1,1,,1,1,1,1,1,1,1,1,,,,,,,,,,,
dailyforex,"Google Turkey (Turkey); Organic",,,,,,,,,,,,,,,,,,,,,,,,,,,,,,,,,,,,,,,,,,,1,1,1,1,1,1,1,1,1,1,1,1,1,1,1,1,1,,1,1,1,1,1,1,1,1,1,1,1,1,1,1,1,1,1,1,1,1,1,1,1,1,1,1,1,1,1,1,1,1,1,1,1,1,1,1,1,1,1,1,1,1,1,1,1,1,1,1,1,1,1,1,1,1,1,1,1,1,1,1,1,1,1,1,1,1,1,1,1,1,1,1,1,1,1,1,1,1,1,1,1,1,1,1,1,1,1,1,1,1,1,1,1,1,1,1,1,1,,1,,1,1,1,,,,1,,,,,1,,1,,,1,,1,,,,,,,,1,,1,,1,,1,,,,,,,,,,,1,,1,1,1,,1,1,1,1,1,1,1,1,1,1,1,1,1,1,1,1,1,7,,1,1,1,1,1,,1,1,1,1,,1,1,1,1,1,1,1,1,1,1,1,1,1,1,1,1,1,1,1,1,1,1,1,,1,1,1,1,1,1,1,,,,,,1,,,1,,1,1
canlı pariteler,"Google Turkey (Turkey); Organic",,,,,,,,,,,,,,,,,,,,,,,,,,,,,,,,,,,,,,,,,,,66,97,99,88,63,60,30,28,33,29,68,68,37,74,75,62,,33,33,34,22,21,22,20,20,19,20,23,18,17,23,22,22,22,,21,23,21,22,21,21,22,23,21,17,17,21,20,24,20,20,22,24,20,25,23,24,26,27,25,23,23,26,27,23,27,27,24,24,23,24,25,23,24,27,27,55,62,65,66,,,,70,66,,,75,68,74,70,,,,66,62,,,,,,,,,,,,,,,,,,,,,,,,,,,,,,,,,,,,,,,,,83,,,82,89,,84,,,,,,,,,19,23,17,17,,,22,,,22,,,,24,,,24,21,,24,30,24,26,23,18,22,20,33,38,36,28,34,31,29,19,24,23,,26,27,27,26,20,16,,,17,21,,24,22,15,18,21,20,20,21,21,26,21,20,26,21,16,17,15,16,20,17,15,17,15,,17,17,17,18,14,13,13,14,,16,,,,,,,,,
forex broker,"Google Turkey (Turkey); Organic",,,,,,,,,,,,,,,,,,,,,,,,,,,,,,,,,,,,,,,,,,,3,3,3,3,3,2,2,2,2,3,2,2,3,4,4,4,8,7,6,3,4,3,1,4,4,4,3,4,3,4,3,4,3,6,7,3,4,3,3,4,3,4,4,7,4,7,8,8,8,7,5,8,7,8,8,9,6,5,6,9,6,6,6,6,6,4,4,7,9,9,5,7,6,6,6,6,7,6,6,6,6,5,6,6,6,6,6,6,6,6,6,8,8,7,8,7,7,7,7,7,8,8,12,11,8,7,10,16,14,12,12,12,21,14,14,12,14,14,,15,18,12,11,,,,13,,,21,,14,13,,10,11,,,12,12,12,,,12,,,,,,,,16,,13,,,,8,,,13,,,,10,,,8,9,,11,12,19,17,10,15,16,12,15,13,15,14,18,14,16,16,13,11,,16,18,15,17,18,17,,15,11,14,18,24,19,20,18,13,13,17,17,18,19,17,20,16,25,16,17,24,18,13,21,18,15,14,,21,22,21,21,25,,19,20,,,,,,,,,,,
forex brokers reviews,"Google Turkey (Turkey); Organic",,,,,,,,,,,,,,,,,,,,,,,,,,,,,,,,,,,,,,,,,,,18,17,17,75,66,17,35,80,76,82,83,1,1,1,1,1,1,1,1,1,,1,1,1,1,1,1,1,1,1,1,1,1,1,1,1,1,1,1,1,1,1,1,1,1,1,1,1,1,1,1,1,1,1,1,1,1,1,1,1,1,1,1,1,1,1,1,1,1,1,1,1,1,1,1,1,1,1,1,1,1,1,1,1,1,1,1,1,1,1,1,1,1,2,1,1,1,1,1,1,1,1,1,1,1,1,1,,,2,1,14,14,13,14,12,15,17,8,8,,8,,,20,8,,,,,8,,8,,,,,,,5,,,,,5,5,5,,,,8,10,13,5,,,,15,,,,,,4,4,,5,4,5,,3,5,14,5,4,5,6,6,9,4,6,7,5,5,4,5,4,4,,5,4,5,3,3,5,4,5,5,7,16,4,5,5,8,5,21,20,4,5,4,4,5,26,8,8,9,21,28,22,24,25,21,19,,26,8,5,5,6,6,,,,9,,,,,3,,,,
Forex Firmaları İncelemeleri,"Google Turkey (Turkey); Organic",,,,,,,,,,,,,,,,,,,,,,,,,,,,,,,,,,,,,,,,,,,8,8,1,1,1,1,2,2,3,3,2,3,4,3,3,3,3,3,3,3,1,1,1,2,2,2,2,2,3,3,3,4,4,4,4,4,4,3,3,3,3,3,4,4,4,3,3,3,3,3,3,3,3,3,3,3,3,3,2,2,2,3,2,2,2,2,1,1,1,1,1,1,2,1,2,1,2,2,3,2,2,2,2,3,2,2,2,1,4,3,3,3,3,3,3,4,4,3,3,3,3,3,9,9,3,8,7,3,3,2,8,9,9,3,3,3,3,3,,3,,4,4,3,,,,4,,,,4,4,,,3,,,3,3,2,2,,,3,7,,,2,,,2,,3,,,,3,,,,,,,3,,,2,3,,3,3,3,3,4,4,4,4,3,3,3,3,3,3,3,2,2,2,,3,4,4,3,3,2,3,2,2,2,,2,4,4,4,4,4,4,4,4,4,4,4,4,4,2,3,2,4,3,4,4,4,3,,4,4,4,3,3,3,,3,,,,,4,,,,,,
Forex Firmaları Listesi,"Google Turkey (Turkey); Organic",,,,,,,,,,,,,,,,,,,,,,,,,,,,,,,,,,,,,,,,,,,3,3,1,1,1,2,2,3,3,1,1,1,2,3,3,2,2,,2,2,2,2,2,2,2,2,2,2,2,2,2,2,2,2,2,2,2,2,2,2,2,2,1,1,1,1,2,2,2,2,1,1,2,2,2,1,1,2,1,1,3,3,3,3,3,3,3,3,3,3,3,3,3,3,3,3,3,3,3,3,3,3,3,3,3,3,3,3,3,3,3,3,3,3,2,3,3,2,3,3,2,2,3,3,2,4,4,4,4,2,2,2,2,2,4,4,3,3,,4,,4,,4,,,,,,,4,4,,,4,,4,4,4,4,4,,4,,,4,4,,,5,,5,,5,,,,6,,,,,,,7,7,6,5,,,6,8,7,8,6,7,6,5,4,7,6,5,5,6,6,4,5,4,,6,5,7,7,8,7,7,9,8,8,8,9,8,8,8,8,11,10,11,9,9,8,9,9,9,8,7,8,7,6,6,6,6,6,,5,5,6,7,7,7,,,,,,,4,,,,,,
Forex İnceleme,"Google Turkey (Turkey); Organic",,,,,,,,,,,,,,,,,,,,,,,,,,,,,,,,,,,,,,,,,,,10,10,9,8,8,4,1,1,3,3,3,3,2,2,2,2,3,3,3,3,3,4,4,4,4,4,4,4,4,10,4,3,4,4,4,10,10,10,10,10,4,4,4,4,4,4,3,4,3,3,2,3,3,3,3,2,2,2,2,2,2,3,3,3,3,2,2,2,2,2,2,2,2,2,2,2,2,2,3,3,2,3,3,3,3,3,3,3,3,3,3,3,2,3,3,3,2,3,2,2,2,2,2,2,2,2,2,2,2,2,2,2,2,2,2,2,2,2,,2,,3,2,,,,,,,2,3,,,,2,2,,,2,,2,,,2,,2,,,,2,,2,,2,,,,,,,,2,,,2,,,2,2,,4,4,2,2,2,2,3,2,4,3,3,3,3,3,3,2,2,2,,3,3,3,2,2,,1,1,1,1,2,1,1,2,1,2,2,1,1,1,1,1,1,2,2,1,2,1,1,2,1,1,2,1,,2,1,2,2,1,1,,,,,,,,,,1,,1,
Forex Siteleri inceleme,"Google Turkey (Turkey); Organic",,,,,,,,,,,,,,,,,,,,,,,,,,,,,,,,,,,,,,,,,,,6,6,7,6,6,6,3,6,7,4,6,1,4,3,2,2,2,3,3,3,3,3,3,2,2,2,2,2,2,3,4,4,3,4,4,4,4,4,4,4,4,4,4,4,4,3,3,3,3,3,3,2,3,3,4,4,2,2,2,2,2,2,2,2,2,2,2,2,2,2,2,2,2,2,2,2,2,2,2,1,1,1,1,1,1,1,2,1,1,1,2,2,2,1,1,1,1,1,1,2,3,3,3,3,3,2,3,3,2,2,3,2,3,2,2,1,1,2,,2,3,3,3,3,,,3,,,,,,,,,2,2,,,2,,,3,3,,3,,,,,,3,,3,,,,4,,,4,,,,4,,,4,,,4,4,4,4,4,4,4,6,4,4,4,4,4,4,4,4,4,4,,4,3,2,2,2,3,4,,,4,6,4,4,4,7,7,7,7,7,7,4,4,4,4,3,7,4,4,6,4,4,4,1,3,,5,2,7,2,4,3,3,,,,,,4,4,,,,,
forex trade,"Google Turkey (Turkey); Organic",,,,,,,,,,,,,,,,,,,,,,,,,,,,,,,,,,,,,,,,,,,9,11,6,6,8,7,23,14,13,13,16,15,18,16,12,26,27,24,26,17,40,38,34,31,25,34,35,34,30,29,20,11,12,13,20,21,26,29,29,,23,27,23,25,26,31,34,,25,26,27,27,25,24,28,24,16,17,16,18,16,16,15,15,16,18,15,14,21,16,17,13,15,17,15,18,25,20,24,23,27,15,14,18,17,21,18,20,22,26,29,29,24,28,24,29,36,44,39,40,38,41,36,37,37,40,44,42,41,38,48,49,48,39,43,48,47,40,,41,43,,47,48,,,,,,,,,,,,51,45,,,46,,,51,,48,,,,54,58,,36,,27,,,,78,,83,,,,,79,,,70,77,,73,79,76,87,86,86,98,87,91,96,82,86,,82,87,85,,78,,88,93,,94,91,77,59,98,,,,,,,,94,,,,,,,,,,,,,,,92,89,91,83,,85,86,66,77,57,75,,,63,,,38,,,,38,,,
Forex Şirketleri Listesi,"Google Turkey (Turkey); Organic",,,,,,,,,,,,,,,,,,,,,,,,,,,,,,,,,,,,,,,,,,,2,2,2,2,2,2,2,2,2,2,2,2,2,2,2,2,2,2,2,2,2,2,2,2,2,2,2,2,2,2,2,1,1,1,1,1,1,1,1,1,1,1,1,1,1,1,1,1,1,1,1,1,1,1,1,1,2,2,2,3,3,3,3,3,3,3,3,3,3,3,3,3,3,3,3,3,3,3,3,3,3,3,3,3,3,3,3,3,3,3,2,2,2,2,2,2,2,2,2,2,2,2,3,4,2,4,3,3,2,2,2,2,2,2,2,2,2,2,,2,,2,2,,2,,4,4,,4,,,4,,4,,,4,,5,,,,4,4,5,,,5,,,7,,6,,,,5,,,,,,,6,6,,5,8,,9,9,7,6,7,6,6,5,6,7,7,6,5,6,5,4,4,4,,4,7,6,6,7,8,8,7,7,7,8,9,9,8,7,8,7,7,6,7,7,6,8,8,8,8,8,8,6,5,5,6,6,6,,5,5,5,5,5,6,,,,,,,,,,5,,4,