﻿keyword,campaign_name,"2011-07-28","2011-07-30","2011-08-06","2011-08-13","2011-08-21","2011-08-28","2011-11-17","2011-11-19","2011-11-24","2011-11-26","2011-12-01","2011-12-03","2011-12-08","2011-12-10","2011-12-15","2011-12-17","2011-12-22","2011-12-24","2011-12-29","2012-01-15","2012-01-22","2012-01-29","2012-02-05","2012-02-13","2012-02-19","2012-02-26","2012-03-04","2012-03-11","2012-03-18","2012-03-25","2012-04-21","2012-04-27","2012-05-04","2012-05-11","2012-05-18","2012-05-25","2012-06-01","2012-06-08","2012-06-15","2012-06-22","2012-06-29","2012-08-10","2012-11-07","2012-11-09","2012-11-16","2012-11-23","2012-11-30","2012-12-08","2012-12-14","2012-12-21","2012-12-28","2013-01-11","2013-01-19","2013-01-25","2013-02-01","2013-02-09","2013-02-16","2013-02-23","2013-03-02","2013-03-09","2013-03-15","2013-03-22","2013-03-30","2013-04-05","2013-04-13","2013-04-20","2013-04-27","2013-05-03","2013-05-11","2013-05-18","2013-05-25","2013-05-31","2013-06-07","2013-06-15","2013-06-22","2013-06-29","2013-07-06","2013-07-13","2013-07-27","2013-08-03","2013-08-10","2013-08-17","2013-08-24","2013-08-30","2013-09-07","2013-09-14","2013-09-21","2013-09-28","2013-10-05","2013-10-11","2013-10-18","2013-10-26","2013-11-02","2013-11-09","2013-11-16","2013-11-23","2013-11-30","2013-12-07","2013-12-14","2013-12-21","2014-01-17","2014-01-24","2014-01-31","2014-02-08","2014-02-15","2014-02-22","2014-03-01","2014-03-08","2014-03-15","2014-03-29","2014-04-05","2014-04-12","2014-04-19","2014-04-26","2014-05-03","2014-05-10","2014-05-17","2014-05-24","2014-05-31","2014-06-07","2014-06-14","2014-06-21","2014-06-28","2014-07-05","2014-07-12","2014-07-19","2014-07-26","2014-08-02","2014-08-09","2014-08-16","2014-08-23","2014-08-30","2014-09-06","2014-09-13","2014-09-20","2014-09-27","2014-10-04","2014-10-11","2014-10-18","2014-10-25","2014-11-01","2014-11-08","2014-11-15","2014-11-22","2014-11-29","2014-12-06","2014-12-13","2014-12-20","2014-12-27","2015-01-24","2015-01-31","2015-02-07","2015-02-14","2015-02-21","2015-02-28","2015-03-07","2015-03-14","2015-03-21","2015-03-28","2015-04-04","2015-04-11","2015-04-25","2015-05-02","2015-05-09","2015-05-16","2015-05-19","2015-05-30","2015-06-06","2015-06-13","2015-06-17","2015-06-20","2015-06-27","2015-07-04","2015-07-11","2015-07-25","2015-08-01","2015-08-08","2015-08-10","2015-08-15","2015-08-22","2015-08-29","2015-09-05","2015-09-12","2015-09-19","2015-10-10","2015-10-31","2015-11-07","2015-11-14","2015-11-21","2015-11-28","2015-12-05","2015-12-12","2015-12-19","2015-12-26","2016-01-02","2016-01-09","2016-01-16","2016-01-23","2016-01-30","2016-02-06","2016-02-13","2016-02-20","2016-02-28","2016-03-07","2016-03-12","2016-05-07","2016-05-14","2016-05-18","2016-05-21","2016-05-28","2016-06-04","2016-06-11","2016-06-17","2016-06-25","2016-07-02","2016-07-09","2016-07-16","2016-07-23","2016-07-30","2016-08-06","2016-08-13","2016-08-19","2016-08-26","2016-09-02","2016-09-09","2016-09-23","2016-09-30","2016-10-07","2016-10-14","2016-10-21","2016-10-28","2016-11-04","2016-11-11","2016-11-18","2016-11-25","2016-12-02","2016-12-09","2016-12-23","2016-12-30","2017-01-06","2017-01-13","2017-01-20","2017-01-27","2017-02-03","2017-02-10","2017-02-17","2017-02-24","2017-03-03","2017-03-10","2017-03-17","2017-03-24","2017-03-31","2017-04-07","2017-04-21","2017-05-05","2017-05-12","2017-05-19","2017-05-26","2017-06-02","2017-06-09","2017-06-16","2017-06-23","2017-06-30","2017-07-07","2017-07-14","2017-07-21","2017-07-28","2017-08-04","2017-08-11","2017-08-18","2017-08-25","2017-09-01","2017-09-08","2017-09-15","2017-09-22","2017-09-29","2017-10-01","2017-10-06","2017-10-13","2017-10-20","2017-10-27","2017-11-03","2017-11-10","2017-11-17","2017-11-24","2017-12-01","2017-12-08","2017-12-15","2017-12-22","2017-12-25","2017-12-29","2018-01-05","2018-01-12"
tradesmarter,"it.dailyforex.com; Organic",,,,,,,,,,,,,,,,,,,,,,,,,,,3,4,4,5,,19,14,15,15,14,15,19,19,19,22,18,27,27,17,34,51,44,43,52,42,57,54,75,74,75,77,75,76,74,,,25,62,63,63,68,58,58,72,,,,,,,9,9,,10,12,11,10,9,11,11,,13,12,12,13,14,15,,,,,,,,,,,,,,,,,,,,,,,,,,,,,,,,,,,,,,,,,,,,,,,,,,,,,,,,,,,,,17,13,23,33,,17,16,11,17,18,16,13,11,13,,39,,23,21,20,23,21,,22,,20,22,23,22,10,25,20,19,17,17,16,18,17,17,14,15,15,15,12,12,16,15,13,13,18,15,14,17,,,,,,,,,,15,,18,17,8,19,16,15,11,17,,10,7,5,6,7,7,6,,,,,9,12,13,16,19,3,1,2,4,5,4,2,4,2,2,2,2,2,2,3,2,4,4,3,4,4,4,3,4,3,3,3,,,,,,,,,,,,,,,,,7,,,,,,,
ioption,"it.dailyforex.com; Organic",,,,,,,,,,,,,,,,,,,,,,,,,,,2,2,2,2,,4,2,3,19,21,2,2,2,27,5,4,2,4,2,2,2,55,2,2,4,2,4,5,4,68,,15,73,,,18,56,33,,32,,,46,,15,22,,26,,,,12,,8,12,23,8,16,14,14,12,17,10,15,16,,,,,,,,,,,,,,,,,,,,,,,,,,,,,,,,,,,17,,,,,,,,,,,,,,,,,,,,,,,,,,,,,,,,,,,,,,,,,,,57,49,,,,,,,,,,,,,,,,,,,,20,20,20,18,21,,,,,,,,,,,,,,,,,,,,,,,,,,,7,,,7,7,9,9,4,3,3,7,4,11,,,,,4,,4,,3,2,2,2,3,2,3,3,3,3,3,3,3,3,3,3,4,3,4,4,3,3,3,,,,,2,3,,4,3,3,2,2,,,,,,,,2,,,,,,,,3,
24option,"it.dailyforex.com; Organic",,,,,,,,,,,,,,,,,,,,,,,,,,,3,4,3,3,,2,2,2,2,2,2,2,1,3,5,3,3,3,3,6,6,7,7,7,7,7,7,7,8,9,8,9,19,10,,12,14,,14,15,19,17,86,,,,48,,53,,71,,63,,,,,16,44,,,,,,59,58,,,,,56,58,62,74,,,,,,,,,,,,,,,,,,72,,91,100,,97,,97,,99,94,96,,96,85,77,,93,87,93,,92,92,,,,,,85,86,85,89,93,,,,,,,,,,,,,,,,,,,,,,,,,,,,,,,,,,,,,,,,,,,,,,,,,,,,,,,,,,,,,,,,,,,,,,,,,,,,,,,,,,,,,,,,,,,,,,,,,45,48,,,,,,,,,,,,,,,,,,,,,,,,,,,,,,,,,,,,,,,,,,,,,
optionfair,"it.dailyforex.com; Organic",,,,,,,,,,,,,,,,,,,,,,,,,,,5,5,4,4,,6,2,5,19,22,6,10,9,26,3,3,4,4,5,5,5,5,4,4,4,4,4,3,4,4,3,4,3,,4,4,5,,5,4,4,7,7,7,5,5,4,5,5,6,5,11,6,5,16,6,5,5,4,5,6,6,20,,16,18,18,,20,18,,,,,,,,,,,,,,,,,,,,,,,,,,,,,,,,,,,,,,,,,,,,,,,,,,,,,,,,,,23,24,24,26,26,33,33,,35,37,42,40,52,53,,50,,,,,,,,,,,,,,,,,,,,,,,,,,,,,,,,,,,,,,,,,,,,,,,,,,,,,,,,,,,32,,35,,,34,32,24,28,29,,36,,,,,,,7,10,,,,,,,17,18,,,,,,17,,,,,,,,,,,,,,,,,,,,,,,,,,,,,,,,
anyoption,"it.dailyforex.com; Organic",,,,,,,,,,,,,,,,,,,,,,,,,,,4,4,7,5,,7,7,7,7,7,7,7,7,7,9,5,8,8,7,7,7,7,7,8,8,8,7,10,11,17,13,14,11,41,90,33,42,,,50,49,54,,,43,85,67,57,,78,56,56,54,,,,,,,,,78,,,85,,,,,88,,48,53,66,83,79,92,62,,76,73,,,85,,,,,,74,68,,,,98,,,,,,,,,97,91,88,,100,,,71,,,62,82,86,96,,,,,,,,,,,,,,,,,,,,,,,,,,,,,,,,,,,,,,,,,,,,,,,,,,,,,,,,,,,,,,,,,,,,,,,,,,,,,,,,,,,,,,,,,,,,,,,,,,,,,,,,,,,,,,,,,,,,,,,,,,,,,,,,,,,,,,,,,,,,,,,,,,,,,,
etoro,"it.dailyforex.com; Organic",,,,,,,,,,,,,,,,,,,,,,,,,,,8,8,8,6,,19,19,20,20,16,34,60,100,66,57,27,27,32,27,29,,,47,52,65,,,99,,,,,,,,,,,,,,,,59,,,,,,,,,,66,,,58,34,,,,39,42,43,34,,,59,74,68,50,42,62,39,74,65,,,,,,,,,,,,,,,,,,,,,,,,,,30,,,,,,,,33,,,,31,35,31,30,,,41,58,41,38,,64,,,50,65,63,65,90,93,81,87,79,91,,97,,,,99,,,,,,,,,,,,,,,,,,,,,,,,,,,,,,,,,,,,,,,,,,,,,,,,,,,,,,,,,,,,,,,,,,,,,22,24,20,25,24,21,21,15,9,11,21,28,13,14,13,20,27,28,29,26,43,44,49,43,23,,,,,,,,,,,,,,,,,,,,,,,,,,,,,,,
saxobank,"it.dailyforex.com; Organic",,,,,,,,,,,,,,,,,,,,,,,,,,,13,16,16,16,,75,68,56,61,92,80,,,,74,30,34,41,45,26,23,23,26,,,,,98,,,,,61,70,,,,,,,,,,,,,,,24,,,,,,,,,,,37,55,62,66,75,49,62,76,62,73,51,20,,,55,,,82,69,,,73,74,77,,,,,,,,,36,49,47,50,39,,,,,44,47,44,47,38,42,48,58,50,54,56,55,48,51,,62,69,41,35,,,,,,,,,,,,,,,80,,,,,,,,,,,,,,,,,,,,,,,,,,,,,,,,,,,,,,,,,,,,,,,,,,,,,,,,,,,,,,44,,,46,,50,22,19,21,28,27,26,29,25,34,41,35,33,36,32,29,30,29,16,15,17,15,18,13,18,9,13,14,45,22,13,26,36,23,20,,19,19,7,6,13,9,8,19,21,27,21,23,27,29,,,,,,49,,,,,,,,,48,,
markets.com,"it.dailyforex.com; Organic",,,,,,,,,,,,,,,,,,,,,,,,,,,8,8,3,4,,,4,4,4,,,,,21,14,3,20,3,3,18,22,16,21,34,57,67,,17,13,21,83,64,65,,80,82,,,,,56,,,,,,,,,,,,,,,,,,,64,44,51,,,,,,,,34,,,,,,,,,,,,,,,,,,,,,,,,,,,,,,,,,,,,,,,,,,,,,,,,67,,,25,,,36,31,39,36,37,,,31,49,54,33,37,40,60,81,,,,,,,,,,,,,,,,,,,,,,,,,,,,,,,,,,,,,,,,,,,,,,,,,,,,,,,,,,,,,,,,,,,,,,,,,,,,,22,,,,18,,17,14,17,,,27,,,,,,,,,,,,,,,,,,,,,,,,,,,,,,,,,,,,,,,,,
fxcm,"it.dailyforex.com; Organic",,,,,,,,,,,,,,,,,,,,,,,,,,,5,5,5,5,,6,5,5,2,2,3,2,2,7,2,4,4,4,6,8,12,12,16,44,51,55,88,,,,,,,,,,,,,,,,,,,,38,,,,,,,,,,,,,,,72,,,67,39,65,50,,,,49,,,,,,48,48,,,,,,50,49,55,,,45,,,,31,,,,57,,,63,60,53,57,36,33,37,38,38,41,67,,57,40,,,,37,56,,,,,,,,,,,,,,41,44,40,39,49,,,,,,,,,,,,,,,,,,,,,,,,,,,,,,,,,,,,,,,,,,47,46,,,,,,,,,,,,,36,34,43,42,50,39,37,29,,4,4,5,5,8,9,7,5,5,5,8,8,7,7,5,8,6,6,8,6,12,10,20,20,20,8,4,,,,,,,,,,,,,,,37,,38,32,,22,6,24,,8,,9,9,15,,,,,,,,,,,
avafx,"it.dailyforex.com; Organic",,,,,,,,,,,,,,,,,,,,,,,,,,,5,5,6,33,,7,7,7,10,10,16,24,24,10,27,18,27,22,19,31,22,19,38,23,,43,74,79,69,39,31,81,79,12,12,,,,,15,,18,19,43,15,17,11,12,14,12,11,11,,14,21,,,,,33,41,32,30,16,,,20,17,,,,,,,,,21,,,,,,,,,,,,,,,13,11,10,5,5,6,11,,,11,,13,6,6,6,8,12,,12,9,,7,10,10,6,6,6,6,,14,,,12,9,,,,15,,,,,,,,,,,,,,,,,,,,,,,,,,,,,,,,,,,,,12,12,13,10,14,,12,15,8,5,4,10,6,7,10,,,,,,,,11,,8,,10,6,6,5,4,4,10,8,5,6,6,4,3,4,9,10,9,5,4,5,6,6,4,4,3,4,12,6,6,3,5,5,4,5,4,5,5,3,3,4,3,3,3,5,4,5,3,5,4,5,6,4,3,,3,2,2,3,2,,2,2,21,2,3,3,4,6,7,5,,,4,,,
brokers forex,"it.dailyforex.com; Organic",,,,,,,,,,,,,,,,,,,,,,,,,,,1,28,49,1,,1,1,3,3,3,3,5,5,44,38,89,85,80,96,92,94,81,79,90,69,93,69,59,59,100,98,88,95,82,87,97,100,100,100,87,88,1,1,1,1,2,1,3,4,2,2,2,7,7,6,7,6,5,8,9,8,8,6,7,7,7,8,10,10,8,9,8,7,8,7,8,8,6,6,5,5,6,5,8,5,5,7,5,5,7,7,5,4,4,4,4,3,3,5,4,6,6,4,4,4,5,5,4,5,5,4,4,5,5,5,6,6,5,5,5,5,4,5,12,11,10,9,9,11,9,9,8,9,9,9,9,9,20,18,18,18,,20,10,9,11,19,12,13,,21,,17,18,13,19,20,18,22,11,19,15,11,8,10,13,13,14,15,14,15,9,13,13,13,10,10,14,15,11,,,15,18,19,,,19,,15,,16,18,10,13,14,14,19,21,19,18,14,13,14,14,17,17,18,20,17,15,26,23,22,17,18,13,12,7,7,14,14,16,8,7,6,6,3,2,4,4,3,8,8,4,7,7,4,7,4,8,9,3,8,9,15,9,15,13,9,,10,5,6,13,8,9,15,9,8,9,,,26,,23,
forex,"it.dailyforex.com; Organic",,,,,,,,,,,,,,,,,,,,,,,,,,,19,19,19,30,,,,,,,,,,,,,69,34,82,82,69,57,67,47,89,83,85,,,,,53,53,22,65,,50,,51,,,,95,,78,,,92,96,,,94,,,,,,,,,,,,,,,100,,96,98,92,85,87,,,,,,,,,,,,,,,,,,,66,69,70,75,77,75,79,75,76,79,79,79,70,81,80,86,87,84,86,82,88,79,90,,,92,95,98,65,55,41,64,96,45,61,80,75,80,76,89,79,89,85,92,91,,,,,,,88,,,,,,,,,,,,,,,,,,,,,,,,,,,,,,,,,,,,,,,,,,47,,,,,,,,,,,,,35,33,36,35,18,32,27,36,,,38,36,30,24,14,32,28,26,23,20,16,19,10,12,21,32,24,16,19,16,14,15,14,20,27,20,29,27,26,35,34,32,31,31,37,39,31,,,,,,,,,,,,42,,,,,,,,34,,28,
opzioni binarie,"it.dailyforex.com; Organic",,,,,,,,,,,,,,,,,,,,,,,,,,,9,11,10,9,,50,58,58,51,50,65,,70,,,55,17,17,13,12,12,12,11,13,12,12,15,18,17,15,16,22,24,29,27,,34,32,28,31,,47,,,,,,,,,,,,,,,,,,,,,,,99,,,,,,100,93,91,86,,,,,,,,,,,,,,,,,,82,86,94,92,92,92,87,91,92,99,,,,,,,,,,,,,,,,,,,,,,,,,,,,,,,,,,,,,,,,,,,,,,,,,,,,,,,,,,,,,,,,,,,,,,,,,,,,,,,,,,,,,,,,,,,,,,,,,,,,,,,,,,,,,,,,,,,,,,,,,,,,,,,,,,,,,,,,47,48,46,48,49,46,46,44,37,44,42,12,,,,,,,,,,,,,,,,,,,
Forex Tools,"it.dailyforex.com; Organic",,,,,,,,,,,,,,,,,,,,,,,,,,,7,7,8,8,,33,35,34,38,38,28,51,55,56,49,21,10,9,19,18,21,23,16,15,15,19,18,15,16,,15,14,15,15,15,13,12,,11,11,,14,,,,,,,,,,,,,,,,,,,20,19,21,22,21,,,,,,,,,,,,,,,,,,,,,,,,,,,,,,,,,,,,,,,,,,,31,,,,,42,47,,,56,,,,,,,,,,,,,,,,,,,,,,,,,,,,,,,,,,,,,,,,,,,,,,,,,,,,,,,,,,,,,,,,,,,,,,,,,,,,,,,,,,,,,,,,,,,,,,,,,,,,,,,,,,,,,,,,,,,,,,,,,,,,,,,,,,,,,,,,,,,,,,,,,,,,,,
Forex Nozioni di base,"it.dailyforex.com; Organic",,,,,,,,,,,,,,,,,,,,,,,,,,,3,46,45,50,,26,25,24,24,24,23,32,32,33,32,58,17,18,39,96,90,100,83,99,99,94,100,100,91,,,98,98,97,93,92,88,84,,98,100,92,94,80,5,5,,6,6,7,4,4,6,4,3,3,3,2,2,2,2,2,2,3,2,2,2,2,2,2,3,2,2,2,5,4,5,5,5,5,4,4,4,2,3,2,2,2,3,2,2,3,3,3,2,2,2,3,3,3,3,3,3,3,3,4,4,4,3,3,3,3,2,1,3,3,2,2,2,1,1,2,2,2,2,3,2,2,2,2,2,2,2,2,2,2,3,4,4,4,4,,3,4,4,4,4,4,7,,6,,7,6,6,6,6,6,6,6,6,6,6,5,5,5,8,5,5,5,5,5,4,4,4,4,4,4,4,4,,,4,4,4,,4,5,4,3,,4,4,5,5,5,5,5,8,8,7,4,5,6,5,6,8,6,6,6,5,8,8,8,10,9,9,7,3,6,7,6,5,5,6,6,7,6,7,5,11,8,8,8,7,9,10,9,10,13,9,8,9,9,6,9,9,9,9,9,,5,8,8,5,9,9,8,9,8,8,,,10,,,
Articoli Forex,"it.dailyforex.com; Organic",,,,,,,,,,,,,,,,,,,,,,,,,,,2,18,18,48,,20,22,23,10,13,13,13,19,22,13,98,99,98,88,94,97,92,97,92,93,96,97,83,92,97,90,80,80,92,89,89,89,92,100,99,,87,70,94,9,10,,18,17,20,19,22,13,13,13,25,15,11,14,13,16,15,13,18,17,17,19,19,17,18,22,23,21,26,26,26,24,25,27,27,25,21,18,23,19,20,19,23,28,33,31,17,18,17,19,15,9,16,9,12,10,12,10,10,9,8,8,8,9,9,9,9,9,10,10,10,11,13,11,12,13,13,13,9,8,9,8,8,8,8,8,9,9,10,9,9,9,11,12,11,11,,11,16,14,,11,9,7,,4,,4,4,4,8,9,10,5,8,9,9,9,8,9,8,7,8,8,8,7,7,8,8,9,8,8,7,7,6,,5,5,7,7,,,8,,4,,6,4,7,4,7,3,6,4,3,14,4,4,4,3,3,5,5,7,13,10,3,3,2,2,3,3,2,1,3,2,1,2,3,1,2,7,2,2,3,3,3,3,3,2,2,2,1,1,2,1,2,2,2,1,1,2,2,1,1,,1,1,2,2,1,1,1,1,2,2,,,3,3,,
Analisi Fondamentale,"it.dailyforex.com; Organic",,,,,,,,,,,,,,,,,,,,,,,,,,,12,11,11,11,,100,94,,,,,,,,,,,,,95,79,52,44,60,,92,,,,,,,,76,,,,,,,,,,,,,,,,,,,,,,,,,,86,82,85,90,88,98,85,91,85,80,80,78,89,96,,,,,,66,,,,,74,77,80,,80,78,87,86,,,,96,,,,,,,,,,,,,,,,,,,,,,,,,99,,,,,,91,89,90,90,89,87,86,90,92,,,89,,,,95,,94,,,,,,,,,,,,,,,,,,,,,,,,,,,,,,,,,,,,,,,,,,,,,,,,,,,,,,,,,,,,,,,,,,,,,,,,,,,,,,,,,,46,,47,48,49,,,,39,,,,,,,,,,,,,,,,,,,,,,,,,,,,,,,,,,
notizie forex,"it.dailyforex.com; Organic",,,,,,,,,,,,,,,,,,,,,,,,,,,6,12,11,7,,11,11,25,13,13,13,25,24,28,28,71,27,27,87,88,83,82,6,6,91,72,77,84,79,79,76,77,78,86,94,93,,93,5,98,90,93,6,7,7,7,,10,9,9,10,10,10,13,13,13,13,8,12,12,13,12,12,12,17,14,13,16,17,16,15,16,15,13,15,16,15,14,12,11,13,13,13,14,19,17,11,12,13,13,13,9,9,15,15,8,17,8,16,12,13,14,13,12,9,9,9,12,11,12,11,11,11,11,14,13,17,13,13,11,12,11,13,8,9,8,8,8,8,8,8,8,10,8,8,7,10,8,11,13,9,,9,12,9,13,11,9,13,,,,15,12,11,17,16,10,18,9,9,12,12,12,12,9,12,13,9,12,11,13,9,8,9,9,9,12,8,7,,,8,7,7,,,9,8,8,,8,8,8,8,8,9,8,8,7,7,6,7,7,7,9,8,10,10,10,8,8,9,8,9,7,4,4,10,3,3,3,3,3,3,3,3,3,3,3,3,3,3,3,3,3,3,3,3,3,3,3,3,3,,3,3,,,3,,3,4,3,5,3,3,3,5,3,3,,,3,3,,3
segnali forex,"it.dailyforex.com; Organic",,,,,,,,,,,,,,,,,,,,,,,,,,,1,1,1,1,,1,1,1,1,1,2,4,4,4,4,98,99,36,99,28,35,88,87,71,97,67,94,74,86,79,89,98,81,100,82,95,83,77,87,11,8,9,11,16,12,14,13,16,20,15,14,17,21,21,21,22,20,20,24,29,27,30,28,29,28,28,28,27,27,32,28,29,28,26,36,37,35,36,40,35,40,45,44,46,49,54,53,54,65,69,26,18,18,18,22,17,17,19,19,16,18,20,24,16,17,19,19,19,19,19,18,18,19,19,19,19,19,20,19,19,18,18,17,19,14,14,18,14,15,18,19,13,12,17,15,17,25,26,34,33,29,,27,25,27,27,30,30,27,,28,,29,29,33,34,30,29,26,24,24,17,14,21,19,20,14,12,12,9,11,10,12,12,9,9,10,9,10,11,,,7,9,9,,8,8,7,7,,6,10,5,4,5,4,7,6,6,6,5,5,5,6,6,7,7,8,7,6,5,5,5,8,7,7,6,5,8,2,5,3,5,5,5,2,2,3,2,3,3,3,2,3,,3,3,3,3,3,3,3,3,3,3,3,4,4,5,,5,6,5,5,6,6,6,5,6,5,5,,4,,,10
Corsi Trading,"it.dailyforex.com; Organic",,,,,,,,,,,,,,,,,,,,,,,,,,,15,35,33,12,,44,45,48,66,48,45,,96,97,97,79,92,98,,,,,,,,,,,,,,,,,,,,,,,,,,,,,,,,,,,,,,,60,,67,62,84,51,55,80,96,96,63,65,65,62,64,72,74,,,,,,,,,,,,,,,,,,,90,,94,88,90,92,92,97,96,97,97,85,,,,100,,,,,,,,,,,,,,,,,,,,,,,,,,,,,,,,,,,,,,,,,,,,,,,,,,,,,,,,,,,,,,,,,,,,,,,,,,,,,,,,,,,,,,,,,,,,,,,,,,,,,,,,,,,,,,,,,,,,,,,,,,,,,,,,,,,,,,,,,,,,,,,,,,,,,,,,,,,,,,,,
Forex Auto Trading,"it.dailyforex.com; Organic",,,,,,,,,,,,,,,,,,,,,,,,,,,2,34,11,2,,42,46,44,38,32,55,30,31,35,39,95,91,92,98,93,97,77,81,80,83,93,97,87,79,99,72,90,93,95,89,95,,92,79,,97,68,76,88,4,4,,4,4,6,5,5,6,5,5,5,4,4,4,3,3,2,2,2,2,3,3,4,4,4,5,5,4,4,6,6,5,5,5,5,6,6,5,4,5,5,4,5,8,6,6,5,6,6,4,4,5,5,5,5,7,5,6,5,5,5,6,5,4,4,4,4,4,4,4,3,3,3,3,3,3,3,3,3,3,3,4,5,3,3,3,4,5,3,4,3,3,3,4,4,4,,5,4,4,3,3,3,3,,3,,3,3,3,3,3,3,3,2,3,3,3,2,2,2,2,2,2,2,2,2,2,3,2,3,3,3,3,3,,,3,3,3,,,4,3,3,,3,3,5,6,4,3,2,2,7,8,7,7,7,3,7,6,4,7,5,9,4,6,6,7,6,3,3,1,2,2,2,2,2,2,2,3,3,2,2,2,4,3,4,2,2,2,2,3,2,2,2,2,3,2,1,2,1,3,2,,2,3,2,,2,3,2,2,3,3,3,,3,,3,4
Forex Brokers,"it.dailyforex.com; Organic",,,,,,,,,,,,,,,,,,,,,,,,,,,1,1,1,1,,6,6,6,6,6,6,12,13,95,46,17,32,33,77,76,78,70,91,88,87,95,84,79,87,,77,80,84,92,97,88,2,2,2,2,2,,3,3,,3,,3,5,5,5,5,19,20,5,17,7,3,7,9,10,11,4,6,6,6,7,8,6,5,6,7,6,3,9,17,17,17,13,9,11,9,9,10,10,11,9,10,12,16,15,6,6,6,10,13,9,6,7,7,12,9,8,17,15,20,16,24,25,24,21,21,25,19,8,29,27,24,26,19,14,16,16,38,39,28,22,30,31,21,22,37,34,32,30,34,,34,36,,33,,42,30,38,40,41,50,26,,,,,27,29,33,34,37,30,29,28,,32,43,,49,,46,28,,,27,25,,26,,,28,,,,44,34,35,36,,,27,28,30,,30,50,47,38,41,43,30,27,31,45,19,8,13,13,36,,14,19,27,15,14,11,13,27,24,13,12,4,2,1,1,2,2,2,1,6,3,7,7,7,3,4,3,8,7,9,6,8,7,6,6,14,13,5,9,8,10,13,13,,14,10,12,,12,12,14,11,11,10,12,,8,9,,
eforex opinioni,"it.dailyforex.com; Organic",,,,,,,,,,,,,,,,,,,,,,,,,,,,19,17,15,,27,27,24,15,21,23,51,40,35,37,89,17,87,96,96,99,99,35,60,95,48,99,97,,81,78,60,,92,,92,96,,95,97,96,94,95,96,8,8,5,4,4,4,4,4,4,12,15,12,14,12,7,9,8,10,10,9,9,10,10,11,12,9,18,12,8,15,13,14,16,8,9,8,12,9,9,17,19,20,18,18,17,19,19,15,13,14,13,12,13,13,13,13,12,11,13,12,12,12,12,12,12,12,16,17,17,14,14,13,13,18,21,,18,15,16,12,13,15,14,15,15,15,16,14,14,14,14,15,15,25,26,26,24,,24,,27,28,29,29,29,26,25,,28,27,26,27,30,25,26,28,29,26,34,28,20,16,18,16,19,12,19,15,27,20,28,17,18,34,,18,,,21,36,32,34,,29,29,20,,28,38,28,27,20,27,31,34,23,24,34,31,29,26,28,26,28,27,30,28,25,23,24,27,22,15,19,13,8,8,6,9,6,8,8,9,8,13,9,15,16,9,9,13,13,15,16,19,23,25,18,24,14,22,24,24,26,24,25,26,28,34,32,19,35,35,35,34,27,34,,,37,,38,
saxo bank,"it.dailyforex.com; Organic",,,,,,,,,,,,,,,,,,,,,,,,,,,,14,16,16,,79,74,67,71,65,54,,,,,67,,,,99,98,,89,,,,,,64,,,,,,,,,,,,,,,,,,,,,,,,,,,,,,,28,,36,40,40,36,39,40,,,30,,,,,,,,,,,,,,,,,,,,62,,30,35,33,38,35,37,38,38,38,39,33,31,33,31,30,34,41,39,33,36,34,32,29,,,39,,,,,,,,,,,,,,,70,,58,58,,,,,,67,,,,,,,,,,,,,,,,,,,,,,,,,,,,,,,,,,,,,,,,,,,,,,,,,,,,,,,,,,,,,25,25,21,25,33,30,27,29,32,37,35,35,35,37,40,31,30,19,18,14,17,19,14,14,11,14,24,24,24,23,46,,40,41,,27,25,25,25,21,25,24,22,38,35,35,37,,,,,,,,,,,,,,,,,,,
recensione di plus500,"it.dailyforex.com; Organic",,,,,,,,,,,,,,,,,,,,,,,,,,,,7,7,7,,24,20,17,20,16,23,34,41,43,43,6,10,10,14,10,8,10,8,9,8,8,12,10,10,10,10,11,11,14,,13,11,11,9,10,10,12,10,11,9,10,,17,16,13,14,17,8,7,11,10,12,14,15,18,21,16,18,21,18,18,16,19,19,34,32,27,30,39,44,47,44,46,45,42,43,41,42,47,48,51,51,51,46,45,41,20,20,21,21,23,23,26,32,26,26,25,30,38,33,36,20,21,20,20,16,21,21,20,29,29,31,29,29,28,34,30,29,43,47,48,50,53,56,44,36,33,52,50,47,42,46,50,52,52,49,,56,,47,,43,47,50,48,,,49,,,,,,,,,,,,,,,,,,,,,,,,,,,,,,,,,,,,,,,,,,,,,,,,,,,,,,,,,,,,,,,,,,48,49,45,41,43,26,29,28,28,26,25,26,23,22,33,27,30,28,37,35,42,38,39,41,39,39,,,,,,,,,,,,,,,,,,,,,,,
forex trading online,"it.dailyforex.com; Organic",,,,,,,,,,,,,,,,,,,,,,,,,,,,11,12,34,,41,39,35,39,43,44,56,46,54,53,34,10,10,11,11,12,13,10,11,18,15,16,28,87,96,23,21,20,,,17,16,19,21,22,21,17,30,41,28,31,,25,23,26,23,25,29,29,27,28,43,26,29,34,32,31,36,33,28,32,29,28,20,21,28,,29,17,35,35,37,35,37,33,35,36,34,38,39,48,49,51,57,56,71,25,26,26,27,25,29,33,27,29,,36,35,46,48,42,61,63,65,67,45,58,46,46,49,52,52,56,61,53,,76,81,66,70,78,87,77,74,69,79,74,70,72,68,79,86,,,,97,,66,,,,,,,,,,,,,,,,,,,,,,,,,,,,,,,,,,,,,,,,,,,,,,,,,,,,,,,,,,,50,50,,,,,,,50,,50,,,48,49,41,45,25,21,24,29,28,24,24,25,23,23,22,23,28,23,26,26,25,38,46,47,,49,47,44,,,,,,42,,,,,,,,,38,,,,,,,,,,
recensione di eforex,"it.dailyforex.com; Organic",,,,,,,,,,,,,,,,,,,,,,,,,,,,37,45,46,,6,6,8,6,6,6,12,11,57,13,99,89,90,100,77,83,85,100,90,60,38,87,38,45,47,67,89,97,99,,85,100,98,89,97,96,96,94,93,5,5,,5,5,5,5,5,5,5,5,5,5,6,7,6,7,8,7,6,6,6,6,6,6,13,15,15,15,16,19,19,14,15,12,16,13,13,12,12,11,15,18,19,16,15,10,8,10,11,11,11,13,12,12,10,11,14,11,7,6,6,6,4,4,2,3,3,3,5,5,5,4,4,5,5,4,4,5,6,7,8,8,8,11,10,10,16,21,23,26,18,18,25,25,25,22,,22,,22,25,25,23,20,17,,,20,23,33,18,16,19,20,16,20,15,29,10,31,10,13,11,14,14,9,16,15,14,15,14,11,16,,30,,25,29,28,36,23,,39,30,28,,21,30,29,28,26,30,33,31,32,35,11,15,13,25,30,26,28,24,21,27,20,18,21,26,26,15,11,8,8,7,10,8,9,14,13,8,14,14,14,9,13,14,8,8,13,12,12,13,11,13,8,12,24,15,17,14,23,34,23,19,22,25,29,25,31,31,30,33,32,25,27,36,35,33,29,30
plus500 opinioni,"it.dailyforex.com; Organic",,,,,,,,,,,,,,,,,,,,,,,,,,,,7,6,7,,21,22,19,24,24,13,27,26,25,28,58,61,60,68,75,70,70,79,70,68,72,75,79,66,59,62,78,84,77,,77,77,77,78,79,,78,79,86,11,15,,10,9,12,12,13,9,14,7,9,9,12,16,17,18,16,14,15,13,14,18,17,17,19,19,26,23,24,26,26,27,26,33,32,,26,31,23,21,14,13,13,14,17,17,11,10,10,12,12,10,10,11,14,13,11,12,15,12,12,12,12,14,13,16,14,14,16,15,14,15,15,16,17,25,22,23,18,19,31,27,28,29,30,29,28,28,27,28,29,33,32,32,33,32,,33,,33,33,34,33,33,31,,,32,31,42,40,40,29,24,26,32,34,36,39,35,35,29,37,,,,,,,,,,,,,,,,,,,,,,,,,,,,,,,,,,45,35,46,40,49,,,,,,41,43,46,44,44,45,44,28,25,22,22,25,21,21,23,18,23,21,27,18,25,20,24,24,27,26,26,30,28,32,31,32,32,35,31,29,28,36,35,33,36,41,41,34,37,37,40,41,39,39,39,39,35,,36,36
etoro opinioni,"it.dailyforex.com; Organic",,,,,,,,,,,,,,,,,,,,,,,,,,,,8,8,8,,17,15,17,7,7,14,22,24,18,7,89,93,11,10,88,86,89,88,80,80,82,99,99,79,98,88,78,85,,94,92,86,99,98,16,98,11,11,17,16,17,17,16,15,15,18,15,12,18,9,8,8,8,9,12,11,10,12,11,10,8,9,12,10,11,12,14,13,11,11,11,12,10,11,9,11,10,10,10,10,10,10,10,10,11,10,8,8,9,9,10,10,11,11,11,11,11,11,10,11,11,12,13,15,14,14,12,14,10,12,10,14,11,16,11,13,11,12,12,12,12,12,13,13,13,12,12,13,12,12,12,11,11,11,11,12,,13,,14,13,12,11,13,13,13,,15,15,13,12,24,25,24,22,24,25,28,28,26,,18,21,27,20,24,46,27,30,30,30,33,32,,44,,,34,41,42,42,,40,35,36,,40,36,39,41,39,36,38,38,,45,41,41,36,33,33,35,32,37,40,40,35,35,36,36,42,40,40,26,25,23,24,26,19,24,24,22,22,25,24,26,23,25,26,23,28,31,31,24,23,24,26,23,27,26,26,27,29,25,33,,33,34,31,28,34,33,32,31,30,32,32,29,27,,27,34
plus500,"it.dailyforex.com; Organic",,,,,,,,,,,,,,,,,,,,,,,,,,,,10,12,12,,35,84,98,,,,,,,,68,,,,100,,,,,,,,,,,,,,,,,,,,95,,,,,,,,,,,,,,,,,,,,,77,,56,53,71,,,,,79,,62,77,,,,,,,,,,,,,,,,,,,,45,,,,,,50,,53,,54,55,51,48,50,,43,,42,,,43,,60,54,39,,,,,,,,,,,,,,,,,,,,,,,,,,,,,,,,,,,,,,,,,,,,,,,,,,,,,,,,,,,,,,,,,,,,,,,,,,,,,,,,,,,,,,,,,,,,,,,,,,,,,50,,50,48,,,,,,,,,,43,,,,,,,,,,,,,,,,,,,,,,,,,,,,,,,,,,,
recensione di plus 500,"it.dailyforex.com; Organic",,,,,,,,,,,,,,,,,,,,,,,,,,,,7,7,50,,19,17,16,18,18,25,40,35,34,37,10,7,7,10,7,6,8,7,8,8,12,11,9,8,9,,11,12,14,12,13,14,13,12,12,,16,13,14,12,13,15,13,12,14,10,16,16,11,16,15,15,16,11,16,17,16,17,17,17,,14,18,21,41,40,32,37,46,53,50,51,54,59,52,55,53,58,59,58,62,58,57,52,55,50,28,29,26,26,29,33,42,47,45,44,44,43,42,44,45,26,28,32,24,25,31,28,33,37,37,33,36,33,28,38,35,35,37,44,50,49,50,55,35,31,35,46,42,45,38,39,43,45,47,49,,51,,43,44,45,45,50,,,,50,50,,,,,,49,49,,,,,,,,,,,,,,,,,,,,,,,,,,,,,,,,,,,,,,,,,,,,,,,,,,,,,,,,,,28,30,27,25,27,25,23,22,24,24,21,22,20,20,23,24,24,25,25,25,28,28,32,32,31,33,41,38,36,38,28,35,29,,,,39,44,49,47,,,50,,,50,,,48
forex analisi,"it.dailyforex.com; Organic",,,,,,,,,,,,,,,,,,,,,,,,,,,,23,14,23,,22,25,20,54,54,50,40,49,33,46,10,7,7,7,6,6,91,68,57,60,60,17,7,6,6,,5,5,17,84,6,6,7,6,6,,4,4,6,6,9,8,8,12,10,12,12,13,17,16,12,18,18,17,23,24,23,21,26,23,26,23,23,23,25,29,27,32,29,32,26,25,22,22,23,24,22,26,31,32,33,31,34,35,33,19,17,17,15,15,17,13,13,15,14,16,17,14,19,19,20,21,22,20,23,23,23,22,16,21,12,22,20,28,15,15,14,15,14,15,15,14,20,20,16,17,15,15,13,16,15,15,17,15,15,15,,13,,14,15,14,13,13,12,,,12,20,19,15,15,16,17,12,10,11,10,10,11,10,10,10,10,10,10,10,13,12,14,15,15,15,,10,,,11,11,11,9,,6,7,7,,14,13,14,13,13,12,15,17,12,14,10,12,7,19,21,19,18,13,12,17,5,5,5,8,8,19,21,10,9,6,6,5,14,8,7,6,4,5,4,14,6,6,7,6,4,7,9,8,8,13,13,14,15,9,9,15,14,12,13,,14,14,13,33,13,16,13,12,14,12,,,16,15,15,15
recensione di saxo bank,"it.dailyforex.com; Organic",,,,,,,,,,,,,,,,,,,,,,,,,,,,24,20,21,,21,20,19,21,21,22,37,30,32,26,36,75,77,80,83,85,82,100,88,75,76,81,77,75,76,98,76,97,87,74,91,75,72,66,76,,67,70,64,10,9,7,8,7,7,7,7,7,6,7,6,7,7,7,7,9,10,10,6,8,10,,11,11,11,12,12,13,11,15,14,13,13,14,15,16,16,16,14,13,14,14,15,19,16,14,15,15,15,15,14,14,13,14,13,13,12,12,11,10,10,9,9,9,8,10,11,11,11,11,10,11,10,10,10,11,10,14,9,9,9,9,9,9,7,7,6,7,7,8,9,8,8,8,7,6,,7,,8,8,7,9,10,9,,,7,9,10,10,12,12,9,9,9,7,8,8,6,9,8,8,8,9,14,9,9,6,6,6,6,5,,6,,6,6,6,5,7,,5,6,7,,5,5,5,5,4,4,6,6,5,5,5,5,6,6,6,6,6,4,5,5,5,5,6,5,6,5,6,3,3,3,3,3,3,3,4,6,5,4,22,5,6,4,6,5,3,4,4,4,4,4,4,4,4,4,3,4,6,3,5,5,5,6,6,6,6,6,7,8,7,7,,6,6,5,,6