﻿manager_id,profile_id,supplier_id,link_from,linking_to,anchor_text,Price,start_date,end_date,link_currency,ip_address,invoice_number,notes,link_type,link_position,אתר,קישור אל,Follow,משתמש מוסיף,הערות,סוג קישור
,Links,,https://www.hamlatza.co.il/index2.php?id=1857&lang=HEB,https://www.recomp.co.il/,https://www.recomp.co.il,,07/11/2018,,,,,,,,recomp.co.il,https://www.recomp.co.il/,F,emojo,-,
,Links,,www.bizpenguin.com/5-causes-of-radiation-how-your-business-can-protect-people-from-it-6333/,stemrad.com/,Stemrad provides protection from gamma radiation,,21/10/2018,,,,,,,,stemrad.com,stemrad.com/,F,-,-,
,Links,,https://www.thefashionisto.com/how-to-choose-the-best-running-shoes-for-women-men/,https://www.nycmode.com/,running shoes for women and men,,14/10/2018,,,,,,,,nycmode.com,https://www.nycmode.com/,F,-,-,
,Links,,www.leelahslaw.com/הייתם-מעורבים-בתאונת-דרכים-כמה-טיפים-ב/,https://www.goldberg-lawyers.com/,עורך דין תעבורה,,14/10/2018,,,,,,,,goldberg-lawyers.com,https://www.goldberg-lawyers.com/,F,-,-,החלפת קישורים
,Links,,www.falungong-hr.net/רוצה-ללמוד-קואצינג-כמה-טיפים-בשבילך/,https://ctiisrael.co.il/,בבית ספר לקואצ'ינג,,14/10/2018,,,,,,,,ctiisrael.co.il,https://ctiisrael.co.il/,F,-,-,החלפת קישורים
,Links,,https://www.aviv-rent.co.il/תאונת-דרכים-עם-רכב-שכור-מה-עושים/,https://www.goldberg-lawyers.com/,באמצעות עורך דין תעבורה,,11/10/2018,,,,,,,,goldberg-lawyers.com,https://www.goldberg-lawyers.com/,F,-,-,
,Links,,tehory-law.org.il/כיצד-לבחור-עורך-דין-פלילי/,https://www.acs-law.co.il/עבירות-צווארון-לבן/,עם בעיות מיסים או צווארון לבן,,08/10/2018,,,,,,,,acs-law.co.il,https://www.acs-law.co.il/עבירות-צווארון-לבן/,F,-,-,
,Links,,www.agenda.co.il/1450/forum/,https://www.acs-law.co.il/עבירות-צווארון-לבן/,איש מקצוע ועורך דין מעולה בתחום צווארון לבן.,,07/10/2018,,,,,,,,acs-law.co.il,https://www.acs-law.co.il/עבירות-צווארון-לבן/,F,-,-,
,Links,,https://www.inn.co.il/News/News.aspx/372081,https://www.emojo.co.il/search-engine-optimization/,קידום אתרים אורגני,,04/10/2018,,,,,,,,emojo.co.il,https://www.emojo.co.il/search-engine-optimization/,F,-,נוסף ב1.5.18,קישור בתשלום
,Links,,https://www.hamlatza.co.il/ese,https://www.ese.co.il/,https://www.ese.co.il/,,02/10/2018,,,,,,,,ese.co.il,https://www.ese.co.il/,F,-,-,
,Links,,https://www.hamlatza.co.il/lior-express,https://www.liorexpress.com/,https://www.liorexpress.com/,,02/10/2018,,,,,,,,www.liorexpress.com,https://www.liorexpress.com/,F,-,-,
,Links,,www.mnews.co.il/stories/7873/מתי-מומלץ-לפנות-לעורך-דין-פלילי-,https://www.ese.co.il/,עורך דין פלילי,,02/10/2018,,,,,,,,ese.co.il,https://www.ese.co.il/,F,-,-,קישור בתשלום
,Links,,https://blogs.cuit.columbia.edu/rqh2000/2018/09/28/post-brexit-uk-realizes-the-importance-of-foreign-languages-to-compete/,https://overseas.huji.ac.il/academics/hebrew-and-other-languages/study-hebrew-language-at-the-hebrew-university-of-jerusalem/,learn Hebrew,,30/09/2018,,,,,,,,overseas.huji.ac.il,https://overseas.huji.ac.il/academics/hebrew-and-other-languages/study-hebrew-language-at-the-hebrew-university-of-jerusalem/,F,-,-,קישור בתשלום
,Links,,www.educationviews.org/why-you-should-consider-studying-scriptural-hebrew-scriptural-greek/,https://overseas.huji.ac.il/academics/hebrew-and-other-languages/study-hebrew-language-at-the-hebrew-university-of-jerusalem/,learn Hebrew,,27/09/2018,,,,,,,,overseas.huji.ac.il,https://overseas.huji.ac.il/academics/hebrew-and-other-languages/study-hebrew-language-at-the-hebrew-university-of-jerusalem/,F,-,-,קישור בתשלום
,Links,,www.proworld.co.il/?p=4054,https://www.ese.co.il/מחיקת-רישום-פלילי/,מחיקת רישום פלילי,,27/09/2018,,,,,,,,ese.co.il,https://www.ese.co.il/מחיקת-רישום-פלילי/,F,-,-,קישור בתשלום
,Links,,https://beforeitsnews.com/v3/green-living/2018/2466881.html,www.lumos-global.com/,solar system,,23/09/2018,,,,,,,,www.lumos-global.com,www.lumos-global.com/,F,-,-,קישור בתשלום
,Links,,https://www.haaretz.co.il/labels/pr/1.6472688,https://www.emojo.co.il/search-engine-optimization/,חברה לקידום אתרים אורגני,,16/09/2018,,,,,,,,emojo.co.il,https://www.emojo.co.il/search-engine-optimization/,F,-,-,קישור בתשלום
,Links,,https://www.10.tv/online/171291,https://www.emojo.co.il/search-engine-optimization/,"מומחה לשיווק דיגיטלי ובעיקר , SEO(קידום אתרים)",,12/09/2018,,,,,,,,emojo.co.il,https://www.emojo.co.il/search-engine-optimization/,F,-,-,
,Links,,www.bizportal.co.il/bizpoint-sponsored/news/article/752896,https://www.emojo.co.il/ranking-factors/,מעל 200 גורמים שמשפיעים על דירוג האתר בגוגל,,12/09/2018,,,,,,,,emojo.co.il,https://www.emojo.co.il/ranking-factors/,F,-,-,
,Links,,https://www.seone.co.il/2018/קידום-אתרים/האם-קידום-אתרים-אורגני-באמת-משתלם-ברור/,https://www.emojo.co.il/search-engine-optimization/,קידום אתרים אורגני,,12/09/2018,,,,,,,,emojo.co.il,https://www.emojo.co.il/search-engine-optimization/,F,-,-,
,Links,,https://elilevy.co.il/השכרת-ציוד-לחגים/,https://salamonfood.co.il/,השכרת חברת קייטרינג,,12/09/2018,,,,,,,,salamonfood.co.il,https://salamonfood.co.il/,F,-,-,
,Links,,https://stumpblog.com/6-things-to-understand-about-gamma-radiation/,https://stemrad.com/protection-from-radiation/,how can you protect yourself from radiation,,12/09/2018,,,,,,,,stemrad.com,https://stemrad.com/protection-from-radiation/,F,-,-,
,Links,,www.ostlaw.co.il/Default.asp?sType=0&PageId=47392,https://www.acs-law.co.il/עבירות-צווארון-לבן/,עורך דין צווארון לבן,,30/08/2018,,,,,,,,acs-law.co.il,https://www.acs-law.co.il/עבירות-צווארון-לבן/,F,emojo,-,
,Links,,www.proworld.co.il/?p=3893,https://www.musach-til.co.il/שירותי-מוסך-הסדר/,מוסך הסדר,,27/08/2018,,,,,,,,musach-til.co.il,https://www.musach-til.co.il/שירותי-מוסך-הסדר/,F,-,-,קישור בתשלום
,Links,,https://www.eventsmagnets.co.il/מאמרים/איך-להפוך-מאירוע-בינוני-לאירוע-מפוצץ/,https://elilevy.co.il/ציוד-למסיבות/,ציוד למסיבות,,27/08/2018,,,,,,,,elilevy.co.il,https://elilevy.co.il/ציוד-למסיבות/,F,-,-,קישור בתשלום
,Links,,https://www.nadlanworld.co.il/?p=2680,https://www.mazok.co.il/,קונסטרוקציה,,27/08/2018,,,,,,,,mazok.co.il,https://www.mazok.co.il/,F,-,-,קישור בתשלום
,Links,,limudimisrael.co.il/לימודי-אימון-אישי-לחיים/,https://ctiisrael.co.il/,לימודי אימון אישי,,27/08/2018,,,,,,,,ctiisrael.co.il,https://ctiisrael.co.il/,F,-,-,קישור בתשלום
,Links,,https://thepulse.co.il/index.php/61601-2018-08-22-08-01-27,https://www.ese.co.il/,עורך דין פלילי,,27/08/2018,,,,,,,,ese.co.il,https://www.ese.co.il/,F,-,-,קישור בתשלום
,Links,,tehory-law.org.il/שליחויות-משפטיות-חובה-לכל-משרד-עורך-די/,https://www.liorexpress.com/שליחויות-בארץ/,ששליחויות בארץ,,27/08/2018,,,,,,,,www.liorexpress.com,https://www.liorexpress.com/שליחויות-בארץ/,F,-,-,קישור בתשלום
,Links,,www.pmag.co.il/106/איך-לעצב-דירות-קטנות-בסטייל/,https://www.anatarc.com/עיצוב-פנים-דירות-קטנות/,עיצוב דירות קטנות,,09/08/2018,,,,,,,,anatarc.com,https://www.anatarc.com/עיצוב-פנים-דירות-קטנות/,F,-,-,
,Links,,www.pctip.co.il/173/איך-לבחור-מחשב-נייד/,https://www.recomp.co.il/מחשבים-ניידים-במבצע/,מחשבים ניידים במבצע,,09/08/2018,,,,,,,,recomp.co.il,https://www.recomp.co.il/מחשבים-ניידים-במבצע/,F,-,-,
,Links,,saloona.co.il/nd/?p=322,https://kisu.co.il/blog/סרום/,סרום,,07/08/2018,,,,,,,,kisu.co.il,https://kisu.co.il/blog/סרום/,F,-,-,קישור בתשלום
,Links,,saloona.co.il/nd/?p=318,https://touch-up.co.il/bblender-brand/,ספוגית beauty blender,,07/08/2018,,,,,,,,touch-up.co.il,https://touch-up.co.il/bblender-brand/,F,-,-,קישור בתשלום
,Links,,https://elilevy.co.il/טיפים-מנצחים-לבחירת-לוקיישן-לאירוע-המ/,https://www.aviv-rent.co.il/,השכרת רכב,,07/08/2018,,,,,,,,www.aviv-rent.co.il,https://www.aviv-rent.co.il/,F,-,-,
,Links,,www.nadlan2.co.il/כך-תהפוך-ליזם-נדלן-מצליח/,https://psagot.org/courses/יזמות-והשבחת-נדלן/,יזמות נדל”ן,,06/08/2018,,,,,,,,psagot.org,https://psagot.org/courses/יזמות-והשבחת-נדלן/,F,-,-,קישור בתשלום
,Links,,limudimisrael.co.il/כל-מה-שרציתם-לדעת-על-תחום-הבינה-העסקית/,https://www.naya-college.co.il/what-is-business-intelligence/,בינה עסקית,,06/08/2018,,,,,,,,naya-college.co.il,https://www.naya-college.co.il/what-is-business-intelligence/,F,-,-,קישור בתשלום
,Links,,rotter.net/blogs/webclub/חוק-משפט/עורך-דין-תעבורה/,https://www.goldberg-lawyers.com/,עורך דין תעבורה,,02/08/2018,,,,,,,,goldberg-lawyers.com,https://www.goldberg-lawyers.com/,F,-,-,
,Links,,https://law.co.il/links/law-firms/israeli-law-firms/,https://www.ese.co.il/,שאול-רן ושות',,12/07/2018,,,,,,,,ese.co.il,https://www.ese.co.il/,F,-,-,
,Links,,https://law.co.il/links/law-firms/israeli-law-firms/,https://www.goldberg-lawyers.com/,"עו""ד אוריאל גולדברג",,11/07/2018,,,,,,,,goldberg-lawyers.com,https://www.goldberg-lawyers.com/,F,-,-,
,Links,,www.homebiz.co.il/vcard3.php?cid=19797,www.homebiz.co.il/vcard3.php?cid=19797,,,08/07/2018,,,,,,,,-,www.homebiz.co.il/vcard3.php?cid=19797,F,-,-,
,Links,,israelnow.co.il/חדשות/כך-תהפכו-את-המשרד-לידידותי-לסביבה/,https://www.gestetnertec.co.il/מדפסות/,מדפסות לייזר,,26/06/2018,,,,,,,,gestetnertec.co.il,https://www.gestetnertec.co.il/מדפסות/,F,-,-,קישור בתשלום
,Links,,www.feminanci.co.il/שליחויות-לעסקים-כך-תעשו-זאת-נכון/,https://www.liorexpress.com/שליחויות-מהיום-להיום/,שליחויות מהיום להיום,,21/06/2018,,,,,,,,www.liorexpress.com,https://www.liorexpress.com/שליחויות-מהיום-להיום/,F,-,-,קישור בתשלום
,Links,,https://www.hamlatza.co.il/index2.php?id=1152&lang=HEB,www.toldot.co.il/,http://www.toldot.co.il/,,17/06/2018,,,,,,,,toldot.co.il,www.toldot.co.il/,F,-,-,
,Links,,https://www.hamlatza.co.il/index2.php?id=1151&lang=HEB,https://www.mazok.co.il/,https://www.mazok.co.il/,,17/06/2018,,,,,,,,mazok.co.il,https://www.mazok.co.il/,F,-,-,
,Links,,https://www.hamlatza.co.il/index2.php?id=1150&lang=HEB,https://ctiisrael.co.il/,https://ctiisrael.co.il/,,17/06/2018,,,,,,,,ctiisrael.co.il,https://ctiisrael.co.il/,F,-,-,
,Links,,https://www.tarbushweb.co.il/למה-קידום-אתרים-אורגני-עדיף-על-ממומן/,https://www.emojo.co.il/search-engine-optimization/,עדיף לעשות קידום אתרים אורגני,,07/06/2018,,,,,,,,emojo.co.il,https://www.emojo.co.il/search-engine-optimization/,F,emojo,-,
,Links,,www.datili.co.il/index.php?id=72691,https://www.emojo.co.il/sem/,איך עושים פרסום בגוגל בצורה נכונה,,07/06/2018,,,,,,,,emojo.co.il,https://www.emojo.co.il/sem/,F,emojo,-,
,Links,,https://www.tgspot.co.il/essential-digital-marketing-for-startups/,https://www.emojo.co.il/sem/,פרסום בגוגל,,07/06/2018,,,,,,,,emojo.co.il,https://www.emojo.co.il/sem/,F,emojo,-,
,Links,,www.rmgcity.co.il/פרסום-בפייסבוק-13-טיפים-שיצילו-לכם-את-הק/,https://www.emojo.co.il/tips-facebook-advertising/,פרסום בפייסבוק באתר של אימוג’ו,,07/06/2018,,,,,,,,emojo.co.il,https://www.emojo.co.il/tips-facebook-advertising/,F,emojo,-,
,Links,,israelilifeusa.com/israelis_in_america/7190,https://www.emojo.co.il/,"שיווק דיגיטלי לחברות ע""י אימוג'ו",,31/05/2018,,,,,,,,emojo.co.il,https://www.emojo.co.il/,F,emojo,-,
,Links,,www.hon.co.il/איך-לחסוך-בעלויות-פרסום-בגוגל/,https://www.emojo.co.il/sem/,בעולם שמתנהל על ידי פרסום בגוגל,,31/05/2018,,,,,,,,emojo.co.il,https://www.emojo.co.il/sem/,F,emojo,-,
,Links,,https://www.il-business.co.il/more-articles/משלוש-יוצאת-1-3-סוגי-מדפסות-מומלצות-לעסק/,https://www.gestetnertec.co.il/multifunctional-printers/,המדפסת המשולבת,,28/05/2018,,,,,,,,gestetnertec.co.il,https://www.gestetnertec.co.il/multifunctional-printers/,F,-,-,
,Links,,https://www.il-business.co.il/more-articles/פתחתם-עסק-חדש-כך-תבחרו-חברת-שליחויות-שת/,https://www.liorexpress.com/שליחויות-מהיום-להיום/,שליחויות מהיום להיום,,28/05/2018,,,,,,,,www.liorexpress.com,https://www.liorexpress.com/שליחויות-מהיום-להיום/,F,-,-,קישור בתשלום
,Links,,www.myguide.co.il/how-to/1581,https://www.acs-law.co.il/עבירות-צווארון-לבן/,המדריך לבחירת עורך דין צווארון לבן,,24/05/2018,,,,,,,,acs-law.co.il,https://www.acs-law.co.il/עבירות-צווארון-לבן/,F,emojo,-,
,Links,,www.objection.co.il/index2.php?id=1361&lang=HEB,https://www.acs-law.co.il/,https://www.acs-law.co.il,,17/05/2018,,,,,,,,acs-law.co.il,https://www.acs-law.co.il/,F,emojo,-,
,Links,,lista.co.il/site/?id=57904,www.anatarc.com/,ענת שמעוני זינגר,,15/05/2018,,,,,,,,anatarc.com,www.anatarc.com/,לא משנה,emojo,-,
,Links,,www.nadlan2.co.il/מחפש-קונסטרוקטור-כך-תדעו-במי-לבחור/,https://www.mazok.co.il/problog/construction/,קונסטרוקטור,,15/05/2018,,,,,,,,mazok.co.il,https://www.mazok.co.il/problog/construction/,F,-,-,קישור בתשלום
,Links,,www.mnews.co.il/stories/6648/טיפים-לקניית-מדפסות-לייזר,www.gestetnertec.co.il/מדפסות/,"כך, מדפסות לייזר מסוימות עתידות להעניק שימוש של שנים ארוכות",,10/05/2018,,,,,,,,gestetnertec.co.il,www.gestetnertec.co.il/מדפסות/,F,-,-,קישור בתשלום
,Links,,tehory-law.org.il/נהיגה-במהירות-מופרזת/,https://www.goldberg-lawyers.com/,עורך דין תעבורה,,10/05/2018,,,,,,,,goldberg-lawyers.com,https://www.goldberg-lawyers.com/,F,emojo,-,
,Links,,www.myguide.co.il/how-to/1551,https://ctiisrael.co.il/,בלימודי אימון אישי,,09/05/2018,,,,,,,,ctiisrael.co.il,https://ctiisrael.co.il/,F,-,-,
,Links,,www.myguide.co.il/how-to/1548,www.toldot.co.il/biography/,לכתיבת סיפור חיים,,09/05/2018,,,,,,,,toldot.co.il,www.toldot.co.il/biography/,F,-,-,
,Links,,https://thepulse.co.il/index.php/57991-5-2018,https://www.gestetnertec.co.il/multifunctional-printers/,מדפסת משולבת,,03/05/2018,,,,,,,,gestetnertec.co.il,https://www.gestetnertec.co.il/multifunctional-printers/,F,-,-,קישור בתשלום
,Links,,www.shilo4u.org.il/מחשבים-נייחים-במבצע/,https://www.recomp.co.il/מחשבים-נייחים-במבצע/,מחשבים נייחים איכותיים במחיר מבצע.,,30/04/2018,,,,,,,,recomp.co.il,https://www.recomp.co.il/מחשבים-נייחים-במבצע/,F,emojo,-,
,Links,,www.boombamela.co.il/מחשבים-ניידים-במבצע/,https://www.recomp.co.il/מחשבים-ניידים-במבצע/,ליהנות ממחירי מבצע על המחשב הנייד ,,30/04/2018,,,,,,,,-,https://www.recomp.co.il/מחשבים-ניידים-במבצע/,F,emojo,-,אתר מאמרים
,Links,,lista.co.il/site/?id=57776,toldot.co.il/,כתיבת סיפור חיים,,23/04/2018,,,,,,,,toldot.co.il,toldot.co.il/,לא משנה,-,-,
,Links,,lista.co.il/site/?id=57775,www.ese.co.il/,עורך דין פלילי,,23/04/2018,,,,,,,,ese.co.il,www.ese.co.il/,לא משנה,-,-,
,Links,,lista.co.il/site/?id=57773,ctiisrael.co.il/,"בי""הס לאימון אישי",,23/04/2018,,,,,,,,ctiisrael.co.il,ctiisrael.co.il/,לא משנה,-,-,
,Links,,lista.co.il/site/?id=57771,www.mazok.co.il/,מצוק מהנדסים,,23/04/2018,,,,,,,,mazok.co.il,www.mazok.co.il/,לא משנה,-,-,
,Links,,lista.co.il/site/?id=57767,www.liorexpress.com/,ליאור שליחויות,,23/04/2018,,,,,,,,www.liorexpress.com,www.liorexpress.com/,לא משנה,-,-,
,Links,,https://law.co.il/links/law-firms/israeli-law-firms/,https://www.acs-law.co.il/,אגמי כהן סבג ושות',,16/04/2018,,,,,,,,acs-law.co.il,https://www.acs-law.co.il/,F,emojo,-,
,Links,,www.lawyeronline.co.il/Details/1665,acs-law.co.il/,אתר אינטרנט,,08/04/2018,,,,,,,,acs-law.co.il,acs-law.co.il/,F,emojo,-,
,Links,,website.giz.co.il/ws19708,https://www.anatarc.com/,כניסה לאתר,,26/03/2018,,,,,,,,anatarc.com,https://www.anatarc.com/,F,emojo,-,
,Links,,www.bugi.co.il/1984/,https://www.gestetnertec.co.il/gilliotines/,גיליוטינה,,25/03/2018,,,,,,,,gestetnertec.co.il,https://www.gestetnertec.co.il/gilliotines/,F,-,-,
,Links,,www.greenbuildingisrael.co.il/construction-planning/,https://www.mazok.co.il/problog/construction/,קונסטרוקטור,,18/03/2018,,,,,,,,mazok.co.il,https://www.mazok.co.il/problog/construction/,F,-,-,
,Links,,www.housemaid.co.il/grinding-machines/,https://vac.co.il/product_category/polishing-cleaners/,מכונת ליטוש רצפה,,18/03/2018,,,,,,,,vac.co.il,https://vac.co.il/product_category/polishing-cleaners/,F,-,-,
,Links,,www.thepros.co.il/article.asp?ArticleID=295,https://ctiisrael.co.il/,שבלימודי אימון האישי,,15/03/2018,,,,,,,,ctiisrael.co.il,https://ctiisrael.co.il/,F,-,-,
,Links,,https://www.hamlatza.co.il/index2.php?id=804&lang=HEB,https://www.gestetnertec.co.il/,https://www.gestetnertec.co.il/,,06/03/2018,,,,,,,,gestetnertec.co.il,https://www.gestetnertec.co.il/,F,emojo,-,
,Links,,www.prosites.co.il/UniqueBusiness.asp?ID=14007,https://www.mazok.co.il/,https://www.mazok.co.il,,28/02/2018,,,,,,,,mazok.co.il,https://www.mazok.co.il/,לא משנה,emojo,-,
,Links,,https://www.2all.co.il/OpenLink.asp?ID=200666,https://www.tomedes.co.il/,,,25/02/2018,,,,,,,,-,https://www.tomedes.co.il/,F,emojo,https://www.2all.co.il/WP_ShowCard.aspx?ID=200666,אתר חברתי
,Links,,www.boombamela.co.il/מדפסות-לייזר/,https://www.gestetnertec.co.il/מדפסות/,היתרונות המרכזיים של מדפסות הלייזר,,21/02/2018,,,,,,,,gestetnertec.co.il,https://www.gestetnertec.co.il/מדפסות/,F,emojo,-,
,Links,,www.portal-asakim.com/Articles/Article53402.aspx,https://www.acs-law.co.il/,רק עורך דין פלילי יוכל לייצג נאמנה את הצד שלכם,,08/02/2018,,,,,,,,acs-law.co.il,https://www.acs-law.co.il/,F,emojo,-,
,Links,,www.bit4all.co.il/אי-גילוי-בתקופת-הביניים-עד-להנפקת-הפו/,https://www.acs-law.co.il/כל-מה-שרצית-לדעת-על-נוהל-גילוי-מרצון/,אי גילוי מרצון על המידע החדש,,31/01/2018,,,,,,,,acs-law.co.il,https://www.acs-law.co.il/כל-מה-שרצית-לדעת-על-נוהל-גילוי-מרצון/,F,emojo,-,
,Links,,forum.kamash.co.il/פורומים/tabid/40/forumid/2/postid/726/scope/posts/Default.aspx#726,https://www.acs-law.co.il/,אולי עורך דין פלילי,,17/01/2018,,,,,,,,acs-law.co.il,https://www.acs-law.co.il/,F,emojo,-,
,Links,,https://oron-law.co.il/p911/,https://www.acs-law.co.il/עורך-דין-פלילי/,"לעבריינים שזקוקים לעו""ד פלילי.",,14/01/2018,,,,,,,,acs-law.co.il,https://www.acs-law.co.il/עורך-דין-פלילי/,F,emojo,-,
,Links,,https://www.ramkol.co.il/biz/94576,https://www.acs-law.co.il/,www.acs-law.co.il/,,01/01/2018,,,,,,,,acs-law.co.il,https://www.acs-law.co.il/,F,emojo,-,
,Links,,https://kurtz-law.co.il/blog/תאונות-אופנוע/,https://www.acs-law.co.il/,"לעו""ד פלילי שייצג אותנו ואת האינטרסים שלנו",,01/01/2018,,,,,,,,acs-law.co.il,https://www.acs-law.co.il/,F,emojo,-,
,Links,,www.roysegal.co.il/תאונת-דרכים/הרקע-לפקודת-נפגעי-תאונות-דרכים/,https://www.acs-law.co.il/,"כלומר מקרה בוא צריך עו""ד פלילי",,01/01/2018,,,,,,,,acs-law.co.il,https://www.acs-law.co.il/,F,emojo,-,
,Links,,www.maamar.net/1476-עיצוב-ואדריכלות-של-בית-פרטי,https://www.anatarc.com/עיצוב-פנים-דירות-קטנות/,עיצוב דירות קטנות וכו',,24/12/2017,,,,,,,,anatarc.com,https://www.anatarc.com/עיצוב-פנים-דירות-קטנות/,F,emojo,-,
,Links,,www.2find2.co.il//hamlatzot.asp?catID=431,www.mazok.co.il/problog/construction/,... www.mazok.co.il/problog/c,,21/12/2017,,,,,,,,mazok.co.il,www.mazok.co.il/problog/construction/,לא משנה,emojo,-,
,Links,,https://www.anatarc.com/אדריכלות-בית-פרטי/,https://www.mazok.co.il/,קחו אדריכל שמכיר קונסטרוקציה,,20/12/2017,,,,,,,,mazok.co.il,https://www.mazok.co.il/,F,emojo,-,
,Links,,https://aloni-alum.co.il/דגשים-לעיצוב-הבית/,https://www.mazok.co.il/problog/construction/,תכנון מוקדם כולל ייעוץ של קונסטרוקטור,,20/12/2017,,,,,,,,mazok.co.il,https://www.mazok.co.il/problog/construction/,F,emojo,-,
,Links,,www.4myhome.co.il/סוגי-קונסטרוקציה-בעולם-הבניה/,https://www.mazok.co.il/problog/construction/,על ידי קונסטרוקטור מקצועי,,23/11/2017,,,,,,,,mazok.co.il,https://www.mazok.co.il/problog/construction/,F,emojo,נמרוד,
,Links,,www.keinan-arch.com/מה-זה-תמא-38/,https://www.mazok.co.il/problog/construction/,קונסטרוקטור מקצועי,,23/11/2017,,,,,,,,mazok.co.il,https://www.mazok.co.il/problog/construction/,F,emojo,-,
,Links,,www.locabizness.com/listing/אביאלי-טייג/,www.avieli.co.il/,http://www.avieli.co.il/,,23/11/2017,,,,,,,,www.avieli.co.il,www.avieli.co.il/,F,emojo,-,
,Links,,www.hifimusic.co.il/האם-ציוד-שמיועד-לעבוד-ב-230V-יעבוד-אותו-הדבר-ב-220V--p319204.html#p319204,www.avieli.co.il/,חנות כלי עבודה,,23/11/2017,,,,,,,,www.avieli.co.il,www.avieli.co.il/,לא משנה,emojo,-,
,Links,,www.detailingforum.co.il/viewtopic.php?f=13&t=205&p=1222#p1222,www.avieli.co.il/,חנות כלי עבודה,,23/11/2017,,,,,,,,www.avieli.co.il,www.avieli.co.il/,F,emojo,-,
,Links,,www.biko.co.il/site.aspx?id=9253,www.avieli.co.il/,avieli.co.il,,23/11/2017,,,,,,,,www.avieli.co.il,www.avieli.co.il/,לא משנה,emojo,-,
,Links,,ksharon.com/forum/viewtopic.php?p=8535#8535,https://www.anatarc.com/עיצוב-פנים-דירות-קטנות/,עיצוב פנים דירות קטנות,,22/11/2017,,,,,,,,anatarc.com,https://www.anatarc.com/עיצוב-פנים-דירות-קטנות/,F,emojo,-,
,Links,,web.kosher2all.co.il/Sites12/forom28/FORUM1.asp,https://pensioni.co.il/getting-objective-pension-counseling/,ייעוץ פנסיוני אובייקטיבי,,20/11/2017,,,,,,,,pensioni.co.il,https://pensioni.co.il/getting-objective-pension-counseling/,לא משנה,emojo,-,
,Links,,www.civil.co.il/site/detail/forum/forum.asp?forum_id=26057&depart_id=230226&time=20/11/2017 11:17:08,https://pensioni.co.il/,ביטוח פנסיוני,,20/11/2017,,,,,,,,pensioni.co.il,https://pensioni.co.il/,לא משנה,emojo,-,
,Links,,www.orly-sade.co.il/site/detail/forum/forum.asp?forum_id=24582&depart_id=201206&time=20/11/2017 11:13:44,https://pensioni.co.il/getting-objective-pension-counseling/,ייעוץ פנסיוני אובייקטיבי,,20/11/2017,,,,,,,,pensioni.co.il,https://pensioni.co.il/getting-objective-pension-counseling/,לא משנה,emojo,-,
,Links,,www.ash-handesaim.co.il/site/detail/forum/forum.asp?forum_id=28145,https://pensioni.co.il/getting-objective-pension-counseling/,ייעוץ פנסיוני אובייקטיבי,,16/11/2017,,,,,,,,pensioni.co.il,https://pensioni.co.il/getting-objective-pension-counseling/,לא משנה,emojo,-,
,Links,,www.organicfood.co.il/general/fast-food/,https://salamonfood.co.il/salamon-friday-food/,המגישים אוכל ביתי מוכן,,14/11/2017,,,,,,,,salamonfood.co.il,https://salamonfood.co.il/salamon-friday-food/,F,-,-,קישור בתשלום
,Links,,https://www.evernote.com/shard/s434/sh/c4c938fd-896a-413f-ac3c-2145aa7f5a83/e6eed8bb0728f62c2ec08ebc1b98cc80,www.recomp.co.il/מחשבים-ניידים-במבצע/, refurbished computers,,13/11/2017,,,,,,,,recomp.co.il,www.recomp.co.il/מחשבים-ניידים-במבצע/,F,-,-,קישור בתשלום
,Links,,forum.kamash.co.il/tabid/40/forumid/2/scope/threads/Default.aspx,https://oron-law.co.il/speeding/,מקרי מהירות מופרזת,,13/11/2017,,,,,,,,oron-law.co.il,https://oron-law.co.il/speeding/,F,emojo,-,
,Links,,www.yamiyami.co.il/קייטרינג-גורמה/הזמנת-אוכל-ביתי/,https://salamonfood.co.il/delivery/,קייטרינג שמתמחה בכל סוגי האוכל הביתי,,13/11/2017,,,,,,,,salamonfood.co.il,https://salamonfood.co.il/delivery/,F,-,-,קישור בתשלום
,Links,,www.tag.co.il/NewSites,https://www.avieli.co.il/,אביאלי,,08/11/2017,,,,,,,,www.avieli.co.il,https://www.avieli.co.il/,F,emojo,-,
,Links,,https://www.hometheater.co.il/vp2712435#2712435,https://www.avieli.co.il/category/כלי-עבודה-וציוד-נלווה,חנות כלי עבודה,,07/11/2017,,,,,,,,www.avieli.co.il,https://www.avieli.co.il/category/כלי-עבודה-וציוד-נלווה,לא משנה,emojo,-,
,Links,,www.globes.co.il/news/docview.aspx?did=1000515858&fid=594,https://www.tomedes.co.il,אין,,31/10/2017,,,,,,,,-,https://www.tomedes.co.il,לא משנה,-,-,קישור מבלוג
,Links,,www.online-persberichten.nl/2017/10/tips-bij-het-kiezen-van-de-juiste-naaigaren-voor-elke-naaimachine/,https://madeirail.com/about-us/,"als het gebruikt wordt in borduurwerk, quilten of naaiwerk",,24/10/2017,,,,,,,,madeirail.com,https://madeirail.com/about-us/,F,-,Prodosh,קישור בתשלום
,Links,,www.mediarelease.nl/mode-en-kleding/soorten-borduur-draden-voor-breiwerk-en-wanneer-u-ze-moet-gebruiken/,https://madeirail.com/about-us/,Goudborduren draden,,24/10/2017,,,,,,,,madeirail.com,https://madeirail.com/about-us/,F,-,Prodosh,קישור בתשלום
,Links,,gratispersberichtplaatsen.nl/tips-om-de-juiste-draad-om-te-quilten/,https://madeirail.com/,juiste type draad voor uw quilt projecten,,24/10/2017,,,,,,,,madeirail.com,https://madeirail.com/,F,-,Prodosh,קישור בתשלום
,Links,,www.artikelplaatsen.net/5-voordelen-van-het-kiezen-voor-rayon-draad-voor-uw-borduurmachines/,https://madeirail.com/,toch is rayon een uitstekende keuze,,24/10/2017,,,,,,,,madeirail.com,https://madeirail.com/,F,-,Prodosh,קישור בתשלום
,Links,,www.bhol.co.il/forums//topic.asp?cat_id=15&topic_id=3140293&forum_id=21023,www.toldot.co.il/biography/,שיכתוב את סיפור חייו הביוגרפי,,24/10/2017,,,,,,,,toldot.co.il,www.toldot.co.il/biography/,F,-,-,
,Links,,www.medportal.co.il/PageDisplay.asp?Artnum=2483,www.blau-ps.com/medical-translation/,תרגום רפואי עונה על ההגדרה הזו בדיוק,,10/10/2017,,,,,,,,blau-ps.com,www.blau-ps.com/medical-translation/,F,-,medportal3@gmail.com,קישור בתשלום